program: Gaussian 09
title: 000255977
version: EM64L-G09RevD.01
frameworkgroup: C1[X(C11H11N3O)]
method: RPBEPBE
basis: SDD
operation: Freq
keyword: #p
keyword: freq=noraman
keyword: PBEPBE/SDD
title: #p freq=noraman PBEPBE/SDD
converged: YES YES NO NO
title: Mulliken charges:
elementType: O N N N C C C C C C C C C C C H H H H H H H H H H H
charge: -0.245968 -0.445766 -0.031425 -0.629304 -0.672999 0.506448 0.440336 -0.477481 -0.447696 -0.360302 0.120588 -0.219262 -0.221557 0.015842 -0.242118 0.248312 0.235893 0.318936 0.252041 0.239857 0.247919 0.232277 0.233713 0.234972 0.355176 0.311571
chargesum: 0.00000
title: Mulliken charges with hydrogens summed into heavy atoms:
elementType: O N N N C C C C C C C C C C C
charge: -0.245968 -0.126830 -0.031425 0.037443 -0.188795 0.506448 0.440336 -0.225441 -0.207840 -0.112384 0.120588 0.013015 0.012156 0.015842 -0.007145
polarizability: 1.82440297e+02 -3.00981877e+01 1.26421794e+02 1.05123685e+01 -3.05719054e+00 1.08219963e+02
1716.lowfreq: -9.8406 -2.6553 -0.0003 0.0006 0.0008 5.7566 12.5829 26.8827 55.5651
frequency: 11.8526 26.8654 55.5580 127.1845 167.2539 190.0627 204.1384 243.3050 252.1816 317.9549 345.2035 402.8968 454.3841 502.1163 521.2306 525.9672 530.2309 551.0202 592.2867 604.6911 618.9307 666.0818 686.7916 709.5284 739.7852 759.8078 810.5893 859.9523 865.4891 870.0804 915.8624 933.2987 969.9114 981.9525 990.1613 1001.3292 1011.9186 1026.1270 1080.5968 1093.9798 1148.3784 1173.8013 1181.1038 1189.2265 1209.1154 1229.3998 1294.2044 1323.1520 1334.3652 1381.2443 1396.3074 1431.7607 1440.0420 1457.6036 1483.3323 1565.0203 1591.5763 1593.7774 1612.3232 1638.0526 1655.8677 2985.7292 3051.6802 3117.1976 3123.0963 3136.8728 3148.8684 3166.5696 3180.7360 3516.8411 3552.5981 3705.4468
redmass: 3.9366 5.4637 5.4755 4.1214 5.3380 4.6469 5.6684 1.1943 5.1690 2.3540 3.2500 2.8198 3.9173 5.0605 1.1353 5.7604 4.6568 5.2256 1.2039 5.5715 6.3280 4.6316 5.4436 1.7524 4.7066 2.0839 3.4306 1.2486 2.3149 2.0585 1.6812 1.7935 2.5986 1.4070 5.9125 1.3515 3.7417 2.2374 1.6775 2.3593 2.1915 1.0647 1.1542 1.1144 2.4284 2.2586 1.7157 1.5024 1.3260 7.4799 3.5451 4.9771 2.0342 1.1808 2.2192 5.4862 3.8471 1.7882 6.0704 2.7558 6.7299 1.0639 1.0969 1.0880 1.0874 1.0906 1.0957 1.1014 1.0934 1.0777 1.0454 1.1052
irintensity: 1.1975 8.6744 0.8223 2.0259 1.4177 7.2656 5.8101 68.9181 4.6176 1.2724 1.0965 0.3431 7.3429 3.7722 257.7536 7.7626 6.5966 3.1907 55.2695 8.5054 0.4106 14.4315 5.6328 62.0263 6.9762 32.6869 10.0444 0.6617 15.6766 20.4454 2.5281 5.9431 12.0358 0.2094 0.8772 0.1028 4.3420 7.8979 13.5057 15.4911 9.7753 0.4403 2.8028 0.8357 1.0739 43.4033 31.1467 37.3166 2.0470 0.4048 10.6923 255.0750 7.4682 18.8296 15.6084 501.9370 1.3756 16.9063 15.7961 296.1344 387.2037 16.4654 6.4902 7.7850 3.3735 6.5765 31.1803 21.0149 3.2038 57.4922 79.9191 41.2629
temp: 298.150 k
press: 1.00000 atm
elementType: 8 7 7 7 6 6 6 6 6 6 6 6 6 6 6 1 1 1 1 1 1 1 1 1 1 1
symmnumber: 1
zpe: 533736.9 jmol-1
zpe.correction: 0.203290 hartree
zpe.thermalcorrener: 0.216360 hartree
zpe.thermalcorrenthalpy: 0.217304 hartree
zpe.thermalcorrgfe: 0.161313 hartree
zpe.sumelectzpe: -664.198543 hartree
zpe.sumelectthermal: -664.185472 hartree
zpe.sumelectthermalent: -664.184528 hartree
zpe.sumelectthermalfe: -664.240519 hartree
dipole: -8.7324 4.0925 -2.2584
dipole: 9.9047
quadrupole: -119.5315 -75.5947 -83.2702
quadrupole: 7.7470 -6.0094 0.2744
quadrupole: -26.7327 17.2042 9.5286 7.7470 -6.0094 0.2744
hfenergy: -664.4018325 hartree
pointgroup: C01 [X(C11H11N3O1)]
dipole: -3.0959436 -2.3046778 -0.5372985 debye
dipolederiv: -0.990283 -0.4632341 -0.1320738 -0.4326105 -0.8542555 -0.17843 -0.0516072 -0.1330193 -0.4617866 -0.9898508 0.1751222 0.3692718 -0.2406826 -0.6656692 -0.2250148 0.2095858 -0.3589043 -0.5171318 -0.6104469 -0.33197 -0.1514542 -0.2485752 -1.1729715 -0.5099522 -0.0499584 -0.4720374 -0.5994776 -0.3590558 0.2267831 -0.0524823 0.2975393 -1.0926405 -0.3663479 0.0204204 -0.4100278 -1.001591 0.0245013 0.0038695 0.0320686 -0.1797794 0.0783673 -0.0634345 0.0670787 -0.0295453 0.0867562 0.4820925 0.0892025 -0.1176348 0.3710913 0.6158391 0.3176618 -0.1336612 0.3412869 0.2284325 0.1188703 0.0583962 0.1344474 0.1464903 0.0059176 0.0378414 0.2616852 0.0417717 0.0291056 -0.7952399 -0.2546249 -0.0064367 -0.0535693 -0.2174998 0.0139449 0.2002784 0.081893 -0.1657187 -0.1983679 0.0176808 0.0159187 0.0523398 -0.0655865 -0.0958245 -0.0044942 -0.1179895 -0.0053992 -0.1312313 0.080486 -0.030724 0.0731753 -0.0189025 -0.0452028 -0.0512798 -0.050883 -0.1256129 1.1865675 0.1809119 -0.1986461 0.0757654 1.3636467 0.7419794 -0.3565058 0.750832 0.8606106 -0.0086059 0.1181785 0.0158636 0.1157582 0.0352757 -0.0470119 -0.0014632 -0.0592165 -0.0716678 -0.0728714 0.0178398 0.0532284 0.0102426 -0.0046252 -0.1175089 0.066297 -0.1106107 0.0418393 1.3104482 0.5437173 -0.0071256 0.4632187 1.2030603 0.5091242 -0.1294698 0.4760187 0.5950143 -0.0190805 0.0580152 0.1199194 0.0492236 -0.100365 -0.0037277 0.0984246 -0.0008939 -0.034315 0.0184963 -0.027845 -0.048234 0.0205568 -0.0427332 -0.1060162 -0.0361966 -0.049658 0.0448157 -0.0260151 -0.0379663 0.0361673 -0.0177394 -0.0118004 0.1418386 0.0081247 0.0688618 -0.0065112 0.2995797 -0.0619604 0.0527064 -0.0740686 0.2008234 -0.0729055 -0.0123885 -0.0680332 0.2008767 0.0803266 0.0373018 0.0689982 0.0405434 0.0535313 -0.0916587 0.0717076 -0.0921215 0.0640423 0.117822 0.0131732 -0.068247 0.0024261 0.0511997 0.0956662 -0.0549774 0.1118476 -0.0320325 0.0676246 -0.1105713 0.0042032 -0.1219188 0.0089891 0.0319722 0.0091868 0.0223074 0.0986961 0.0227492 -0.1171753 -0.0048618 -0.1361511 -0.0166195 0.0472033 -0.0069884 0.0505332 0.1017152 0.0929452 -0.0073074 -0.0467986 0.0030987 0.0400844 0.1139921 -0.0692099 0.1094688 -0.0169694 -0.0137735 -0.0546568 -0.1195824 -0.0598863 0.1052621 -0.0016413 -0.1314628 -0.003453 0.0325334 0.2321761 -0.0886196 0.0125371 -0.0711165 0.25824 -0.061333 0.0181623 -0.0495014 0.3428412 0.1606225 -0.0647468 0.0689711 -0.0853718 0.2434322 -0.0652142 0.0587116 -0.0489264 0.3109346 unknown
polarizability: 170.6116778|36.8143953|132.4622815|13.4406865|12.3623816|114.0080948 unknown
InChI: InChI=1S/C11H11N3O/c12-11-13-9(7-10(15)14-11)6-8-4-2-1-3-5-8/h1-5,7,13H,6,12H2
charge 0 multiplicity 1
26 atoms
O  4.000136 1.961883 0.750994
N  1.028074 -0.765522 0.09952
N  3.267461 0.00787 -0.330553
N  2.462037 -1.911053 -1.399356
C  -0.599582 0.279389 1.655398
C  0.766472 0.291347 0.988124
C  -1.757517 -0.021181 0.702282
C  1.756686 1.214442 1.217822
C  -2.612285 -1.129682 0.927039
C  -1.998647 0.809556 -0.424441
C  2.278996 -0.853364 -0.52754
C  -3.690481 -1.401569 0.051547
C  -3.072918 0.540546 -1.299477
C  3.07887 1.114556 0.552659
C  -3.923474 -0.566713 -1.064275
H  -0.74066 1.263326 2.13765
H  -0.594492 -0.472973 2.469151
H  0.259637 -1.39339 -0.148344
H  1.594696 2.050027 1.903222
H  -2.443361 -1.775029 1.798456
H  -1.340692 1.667335 -0.611131
H  -4.346239 -2.258142 0.243249
H  -3.249566 1.192972 -2.161769
H  -4.759004 -0.772961 -1.742141
H  3.370184 -1.96413 -1.85464
H  1.769068 -2.63654 -1.560945
