program: Gaussian 09
title: 000250566
version: EM64L-G09RevD.01
frameworkgroup: C1[X(C16H18N2O2S)]
method: RPBEPBE
basis: SDD
operation: Freq
keyword: #p
keyword: freq=noraman
keyword: PBEPBE/SDD
title: #p freq=noraman PBEPBE/SDD
converged: YES YES NO NO
title: Mulliken charges:
elementType: S O O N N C C C C C C C C C C C C C C C C H H H H H H H H H H H H H H H H H H
charge: 0.837260 -0.567338 -0.551092 -0.168316 -0.155107 -0.521693 -0.397733 0.126975 0.399803 -0.379201 -0.296417 -0.362651 -0.072482 -0.665311 -0.252200 -0.238320 -0.244636 -0.239036 -0.216154 -0.206244 -0.221248 0.286159 0.253296 0.213664 0.272019 0.226260 0.220356 0.252818 0.232635 0.236732 0.241483 0.219832 0.233501 0.227294 0.289061 0.279211 0.236884 0.236600 0.233337
chargesum: 0.00000
title: Mulliken charges with hydrogens summed into heavy atoms:
elementType: S O O N N C C C C C C C C C C C C C C C C
charge: 0.837260 -0.567338 -0.551092 -0.168316 -0.155107 0.017762 0.087950 0.126975 0.399803 0.067415 -0.043600 -0.130016 -0.072482 0.032736 -0.018699 -0.011026 0.044425 0.040174 0.020730 0.030356 0.012089
polarizability: 3.79820759e+02 -2.10618168e+01 2.50419299e+02 8.74703020e-01 1.30266367e+01 1.49277731e+02
1716.lowfreq: -6.4193 -0.0015 0.0009 0.0013 0.9862 6.6294 15.9330 20.1354 38.9074
frequency: 14.2773 20.1295 38.7073 46.2371 64.1202 78.8111 101.5923 123.3404 130.7633 149.1005 173.4008 183.2697 195.9282 207.5955 240.9047 288.5159 322.9884 332.9147 350.2005 363.8381 372.6267 405.5851 411.5432 449.2061 469.9744 492.8103 498.3681 509.3428 539.5452 551.5821 603.3865 637.8479 653.4275 681.3643 693.4227 747.0536 755.5844 756.9450 764.1258 783.6157 799.6190 844.6872 853.0083 867.5506 874.1963 906.9213 933.3991 939.1683 951.1467 978.0308 978.6693 984.7000 1002.1951 1008.0139 1021.3885 1025.0694 1042.4284 1045.4889 1070.2139 1073.2261 1075.4507 1109.3892 1142.5587 1170.6218 1172.0291 1175.2245 1187.6036 1216.8185 1246.7877 1275.5660 1282.9343 1296.7164 1299.9672 1339.3897 1341.7712 1364.9247 1382.9238 1385.3531 1391.3163 1403.7837 1432.9197 1437.5592 1451.0650 1452.5531 1466.5675 1468.5569 1480.6221 1491.4095 1512.0305 1539.0779 1577.9833 1600.2188 1610.5753 2964.7547 2970.5788 2990.6749 3001.4015 3027.6656 3050.9770 3054.2126 3088.6820 3097.7690 3132.3768 3133.1170 3143.1110 3145.1340 3153.5540 3161.1578 3162.1632 3171.4085 3172.9267
redmass: 5.8278 5.0277 4.5677 4.5856 5.1876 3.3056 3.7288 4.3235 6.6575 5.4281 5.6999 4.3323 1.6862 1.8070 8.5169 3.1794 2.9817 5.9210 2.7936 7.4377 3.6787 2.8476 6.3921 3.1053 5.0893 3.3154 4.1083 4.3959 4.0418 3.8663 6.4699 3.0093 6.7667 4.0127 2.4036 2.6498 1.7720 1.4981 4.8729 1.4952 2.6334 1.5713 1.2913 3.1755 4.6819 3.0130 1.3544 2.2773 1.3783 1.8128 2.7857 1.3800 1.3297 4.3708 3.3374 2.9047 2.3894 2.0764 1.9424 1.5383 2.3012 2.0135 1.4875 1.0620 1.2283 1.1286 1.5699 1.3335 1.4967 1.3184 1.9724 2.1836 1.3098 1.3430 1.3152 1.5589 8.6769 1.9232 1.2355 2.7352 2.2103 1.4320 2.0057 1.7689 1.3121 1.0713 1.0589 1.2029 1.8477 5.9773 5.8576 6.8820 5.9752 1.0661 1.0598 1.0356 1.0606 1.1006 1.1009 1.1005 1.0995 1.1017 1.0853 1.0855 1.0885 1.0891 1.0927 1.0941 1.0964 1.1013 1.1002
irintensity: 1.9221 1.7485 1.2813 1.6249 1.9460 1.7559 1.4479 9.1715 11.0533 3.5182 2.1617 18.2578 14.5745 20.0723 12.0239 6.5917 2.5499 10.8256 1.9419 8.0573 10.1123 0.0381 51.5511 4.0046 40.5874 2.4990 73.4239 24.1302 16.6390 4.8226 0.0161 0.4198 2.9202 0.9730 29.3878 35.0572 21.8350 87.8502 76.7082 8.3552 1.9722 1.5125 2.6645 25.9489 28.3391 0.4364 2.4595 14.5325 0.5102 5.4676 5.8126 0.1844 1.2176 6.3641 0.9972 2.8890 12.4797 18.6046 0.9635 7.1070 31.1338 19.4575 4.1891 1.5833 14.6600 14.1680 34.3588 33.0905 65.2609 60.3056 13.3905 127.0439 4.5838 60.0107 39.2801 29.4842 3.3916 8.5837 17.9405 1.2814 15.2697 37.0384 33.6435 22.5892 72.7412 26.3998 4.2871 23.1896 161.7755 92.6632 12.2763 1.0203 72.6187 16.9349 19.5440 24.8910 67.2082 7.4212 15.7559 21.3860 48.7847 29.1340 0.4696 2.0609 9.9420 6.7425 2.5265 24.2184 8.0646 51.2877 25.0757
temp: 298.150 k
press: 1.00000 atm
elementType: 16 8 8 7 7 6 6 6 6 6 6 6 6 6 6 6 6 6 6 6 6 1 1 1 1 1 1 1 1 1 1 1 1 1 1 1 1 1 1
symmnumber: 1
zpe: 806325.2 jmol-1
zpe.correction: 0.307113 hartree
zpe.thermalcorrener: 0.327377 hartree
zpe.thermalcorrenthalpy: 0.328321 hartree
zpe.thermalcorrgfe: 0.255764 hartree
zpe.sumelectzpe: -1276.815871 hartree
zpe.sumelectthermal: -1276.795607 hartree
zpe.sumelectthermalent: -1276.794663 hartree
zpe.sumelectthermalfe: -1276.867220 hartree
dipole: -3.0215 2.3445 -2.5794
dipole: 4.6130
quadrupole: -92.7112 -127.3359 -140.0676
quadrupole: 11.6523 -4.9311 9.3045
quadrupole: 27.3271 -7.2977 -20.0293 11.6523 -4.9311 9.3045
hfenergy: -1277.1229843 hartree
pointgroup: C01[X(C16H18N2O2S1)]
dipole: -1.1358145 -0.9774383 1.0238886 debye
polarizability: 377.3154|27.600338|253.0190804|-2.6118565|12.3928583|149.1833087 unknown
InChI: InChI=1S/C10H13N2.C6H5O2S/c1-2-12-8-7-11-9-5-3-4-6-10(9)12;7-9(8)6-4-2-1-3-5-6/h3-6H,2,7-8H2,1H3;1-5H
charge 0 multiplicity 1
39 atoms
S  1.006562 1.171978 -0.529315
O  1.078326 2.813802 -0.300708
O  0.516427 0.560253 -1.982655
N  -0.32879 0.366804 1.214793
N  -3.123737 0.588166 0.438049
C  -1.112076 1.603683 1.46407
C  -2.284309 1.809166 0.48592
C  -1.059883 -0.711539 0.739033
C  -2.480797 -0.638375 0.398722
C  -4.551336 0.748531 0.097378
C  -0.391441 -1.97775 0.666043
C  -3.159369 -1.855721 0.07493
C  2.762383 0.523805 -0.256624
C  -4.817075 0.857629 -1.423387
C  -1.072333 -3.144744 0.316965
C  -2.468952 -3.074433 0.031518
C  3.142783 -0.645869 -0.936797
C  3.613358 1.23445 0.606235
C  4.456325 -1.129486 -0.732074
C  4.922733 0.735283 0.798697
C  5.339401 -0.44387 0.135645
H  -0.424801 2.468459 1.386849
H  -1.470115 1.540347 2.512261
H  -2.912747 2.655027 0.817841
H  -1.886689 2.052506 -0.520847
H  -5.122883 -0.091702 0.530898
H  -4.907923 1.665699 0.60207
H  0.672561 -1.991692 0.926924
H  -4.222571 -1.841789 -0.179852
H  -4.286287 1.723538 -1.85624
H  -4.47727 -0.04779 -1.955294
H  -5.898046 0.98832 -1.612966
H  -0.547756 -4.103953 0.271748
H  -3.014278 -3.985899 -0.238589
H  2.442332 -1.134199 -1.622708
H  3.269432 2.156821 1.084965
H  4.788092 -2.033854 -1.253325
H  5.614328 1.268632 1.459629
H  6.355715 -0.823332 0.288799
