program: Gaussian 09
title: 000018291
version: EM64L-G09RevD.01
frameworkgroup: C1[X(C5H5NO2)]
method: RPBEPBE
basis: SDD
operation: Freq
keyword: #pfreq=noraman
keyword: PBEPBE/SDD
title: #p freq=noraman PBEPBE/SDD
converged: YES YES NO NO
title: Mulliken charges:
elementType: O O N C C C C C H H H H H
charge: -0.289540 -0.186155 0.004026 -0.735257 0.259088 0.429168 -0.590562 -0.171442 0.259712 0.256051 0.253585 0.250723 0.260603
chargesum: 0.00000
title: Mulliken charges with hydrogens summed into heavy atoms:
elementType: O O N C C C C C
charge: -0.289540 -0.186155 0.004026 0.034091 0.259088 0.429168 -0.079236 -0.171442
polarizability: 7.50978635e+01 2.70852199e+00 7.83288947e+01 3.18019081e+00 3.08893489e+00 4.14193543e+01
1716.lowfreq: -2.8585 -0.5292 -0.0005 -0.0001 0.0003 6.8225 41.9245 68.5049 93.9762
frequency: 41.9109 68.4919 93.9740 141.6268 208.4009 300.1342 352.1339 394.0878 535.4795 545.5958 610.3761 656.5742 695.9636 750.2644 831.8024 948.4672 955.8038 988.4447 1041.8800 1148.6989 1213.0737 1386.2562 1399.5923 1451.4267 1451.7220 1637.0201 1694.3435 2182.1718 3011.1797 3099.4055 3131.1820 3148.1878 3249.6349
redmass: 3.2031 1.4736 3.1432 6.2495 4.8275 6.2100 3.7060 3.3963 5.1910 3.3050 6.7506 5.0430 1.6169 2.5460 3.4214 2.2149 1.5346 2.2171 1.6489 3.0792 3.7181 1.2324 1.1745 1.0468 1.0538 5.8225 10.5176 12.6324 1.0370 1.0970 1.0623 1.1014 1.1171
irintensity: 1.6092 0.8663 2.4960 2.9631 7.6323 1.9093 2.1125 1.7679 12.7262 3.4084 8.6960 11.0027 1.7353 3.9455 46.7054 42.3791 82.7866 126.5108 11.4996 422.7007 25.5028 53.5160 5.6236 19.9567 26.1676 46.5631 180.3748 2.1286 0.3443 4.1771 2.2281 6.7148 0.9450
temp: 298.150 k
press: 1.00000 atm
elementType: 8 8 7 6 6 6 6 6 1 1 1 1 1
symmnumber: 1
zpe: 235456.8 jmol-1
zpe.correction: 0.089681 hartree
zpe.thermalcorrener: 0.098391 hartree
zpe.thermalcorrenthalpy: 0.099335 hartree
zpe.thermalcorrgfe: 0.055146 hartree
zpe.sumelectzpe: -398.096257 hartree
zpe.sumelectthermal: -398.087547 hartree
zpe.sumelectthermalent: -398.086603 hartree
zpe.sumelectthermalfe: -398.130791 hartree
dipole: -2.0263 4.1526 -0.7053
dipole: 4.6741
quadrupole: -39.5297 -49.6813 -48.5806
quadrupole: 6.3759 4.2460 2.8161
quadrupole: 6.4008 -3.7508 -2.6501 6.3759 4.2460 2.8161
hfenergy: -398.1859375 hartree
pointgroup: C01 [X(C5H5N1O2)]
dipole: -1.0252635 -1.3326477 0.7447113 debye
dipolederiv: -1.4274458 0.6851362 -0.0802995 0.6233413 -0.7768578 0.1784303 -0.0664613 0.0961247 -0.4326081 -0.544601 -0.0123684 0.1890216 0.2507015 -0.5125071 0.1990803 -0.1663091 0.3683102 -0.7437944 -0.2204387 -0.016644 -0.0193974 -0.0068697 -0.2016083 -0.029789 -0.0295675 -0.0026002 -0.2119234 -0.2932533 0.0601289 0.1645662 0.0638303 -0.0120899 0.0040799 0.2471279 -0.0261387 -0.1595209 1.431976 -0.4940094 -0.1688961 -0.9075921 0.9652672 -0.4449174 0.252522 -0.6023086 1.0479512 1.1480807 -0.3279505 -0.1047495 -0.1113079 0.4001609 0.0920607 -0.3320369 0.1843331 0.1907953 -0.1954581 0.0830106 -0.0985054 0.1417654 -0.2278035 -0.0331676 -0.029864 -0.0020996 -0.309379 -0.1174813 0.0762702 0.0710868 -0.011058 0.0622955 0.0125988 0.1457795 -0.053802 0.046537 0.0722618 -0.0271164 -0.0479083 0.0031095 0.1014506 -0.0764277 -0.0375887 -0.0658352 0.0045087 0.088526 -0.0259994 0.0282592 -0.0646552 -0.0385414 0.0263476 0.0002688 0.0225703 0.140917 0.0110131 0.0629451 -0.0227716 0.0824611 0.0679464 0.056578 -0.059693 0.066402 0.0545603 0.0633082 -0.0610933 0.0397795 -0.0782214 0.0625789 0.0133116 0.0471595 0.0089769 0.184571 -0.0164876 -0.0023096 0.0498144 0.0144951 0.1097085 0.0018145 0.0286628 0.0060671 0.1873853 unknown
polarizability: 73.0280067|-3.0260976|78.925854|-6.2328052|-4.8225769|42.8922519 unknown
InChI: InChI=1S/C5H5NO2/c1-4(3-6)8-5(2)7/h1H2,2H3
charge 0 multiplicity 1
13 atoms
O  -0.625159 -0.546696 0.540233
O  -1.153264 0.916056 -1.220736
N  2.226709 1.371635 -0.279547
C  -2.761996 0.538452 0.626551
C  -1.481942 0.378714 -0.152981
C  0.701352 -0.754391 0.05047
C  1.16173 -2.021521 -0.096303
C  1.521777 0.415394 -0.144881
H  -2.550708 1.019729 1.597584
H  -3.205996 -0.448448 0.840135
H  -3.468591 1.156159 0.05472
H  0.502696 -2.876298 0.079992
H  2.199993 -2.204685 -0.382838
