program: Gaussian 09
title: 000255930
version: EM64L-G09RevD.01
frameworkgroup: C1[X(C4H9NO4)]
method: RPBEPBE
basis: SDD
operation: Freq
keyword: #pfreq=noraman
keyword: PBEPBE/SDD
title: #p freq=noraman PBEPBE/SDD
converged: YES YES NO NO
title: Mulliken charges:
elementType: O O O O N C C C C H H H H H H H H H
charge: -0.468768 -0.474257 -0.436812 -0.276910 -0.596317 -0.134061 -0.233679 -0.364061 0.189501 0.251449 0.296910 0.213538 0.232336 0.375582 0.363747 0.368452 0.353414 0.339937
chargesum: 0.00000
title: Mulliken charges with hydrogens summed into heavy atoms:
elementType: O O O O N C C C C
charge: -0.093185 -0.110509 -0.068360 -0.276910 0.097033 0.117388 0.063231 0.081812 0.189501
polarizability: 7.10697155e+01 -1.72940795e+00 6.65186092e+01 1.61911540e+00 -3.44548924e+00 5.04431262e+01
1716.lowfreq: -18.9272 -13.2677 -5.5665 0.0004 0.0006 0.0008 58.7725 76.1318 101.3940
frequency: 58.6704 76.0819 101.3478 159.9557 219.2774 223.1635 305.1864 389.2174 433.8557 467.1472 496.6512 535.6171 562.9191 596.7600 607.9774 654.2810 676.7463 716.7390 805.8226 909.8931 928.3251 959.1562 1012.1767 1025.3358 1061.9684 1093.4319 1158.3013 1210.3477 1242.1983 1247.2837 1320.5403 1339.6440 1356.3978 1359.5341 1370.1550 1390.8319 1470.7852 1572.4670 1634.2552 2986.6196 3022.6263 3057.3050 3104.3527 3492.2725 3501.3179 3503.9163 3511.1204 3662.9778
redmass: 6.6742 3.5632 4.4733 4.4702 4.6006 7.3667 4.2650 4.5781 2.7203 5.8380 1.3226 2.0139 1.1203 2.5232 1.1202 1.7391 1.1782 2.7780 4.1241 3.0278 3.5377 4.8932 1.8166 3.1248 1.9442 2.7152 1.0861 1.3040 1.3348 1.2448 1.2936 1.3995 1.3845 3.2568 1.2470 1.2429 1.0759 1.4551 3.9634 1.0679 1.0851 1.0844 1.0978 1.0657 1.0648 1.0451 1.0649 1.1048
irintensity: 14.5012 8.8402 5.3597 8.1272 7.5761 1.1168 18.9484 9.7074 1.6445 5.7036 0.6192 54.4374 201.1150 35.1126 291.4131 212.1593 86.7080 46.3328 15.0224 20.3151 12.5401 141.7564 51.2863 6.1391 1.3344 16.3969 51.5236 49.5374 21.0691 7.3379 8.3328 39.5908 2.7499 94.8711 22.3846 25.2560 6.3700 65.6234 317.4459 37.5593 18.8783 11.8839 26.3504 17.2087 17.1226 51.4843 21.8369 53.0771
temp: 298.150 k
press: 1.00000 atm
elementType: 8 8 8 8 7 6 6 6 6 1 1 1 1 1 1 1 1 1
symmnumber: 1
zpe: 374389.0 jmol-1
zpe.correction: 0.142597 hartree
zpe.thermalcorrener: 0.152462 hartree
zpe.thermalcorrenthalpy: 0.153407 hartree
zpe.thermalcorrgfe: 0.107331 hartree
zpe.sumelectzpe: -512.728844 hartree
zpe.sumelectthermal: -512.718979 hartree
zpe.sumelectthermalent: -512.718035 hartree
zpe.sumelectthermalfe: -512.764110 hartree
dipole: 2.5448 -1.8647 1.5699
dipole: 3.5239
quadrupole: -54.7050 -54.4392 -54.3561
quadrupole: -9.2569 1.2354 -2.1968
quadrupole: -0.2049 0.0609 0.1440 -9.2569 1.2354 -2.1968
hfenergy: -512.8714417 hartree
pointgroup: C01 [X(C4H9N1O4)]
dipole: 1.1964209 0.3097632 0.628275 debye
dipolederiv: -0.5782132 -0.14256 -0.0169061 -0.1111515 -0.4290053 0.2176116 -0.0446351 0.1794581 -0.7020572 -0.7208866 0.0415099 -0.0888633 0.1210562 -0.5402235 -0.2677287 -0.0410125 -0.2461315 -0.4351441 -0.5365317 0.1758707 0.1529576 0.1748871 -0.4576124 0.0791861 0.1872043 0.0889998 -0.6757141 -0.6211599 0.1268098 0.0798556 0.0336135 -0.4635812 -0.2100528 -0.1997398 -0.1691027 -0.9846236 -0.8588392 -0.0788922 -0.5076435 -0.0530179 -0.6075835 0.1089003 -0.3192336 0.0672654 -0.7303912 0.2779185 0.084637 -0.0328552 0.1661038 0.2788588 -0.1169004 0.0096525 -0.1646942 0.3482585 0.0754512 0.1049715 0.0308715 -0.0696801 0.447244 0.1847651 0.0717078 0.1154168 0.1238678 0.3130232 -0.0106326 -0.0247469 -0.0208982 0.2958324 -0.0720055 -0.1117191 -0.06417 0.5392755 1.0876171 -0.0867666 0.3540012 -0.0201575 0.253367 0.2987424 0.372544 0.2721903 1.2501128 0.0476351 -0.0323085 0.0065459 -0.0439576 -0.1097253 -0.0377935 -0.0037008 -0.0628483 -0.0196517 0.1007319 -0.0408597 0.0096756 -0.0085541 -0.016257 0.0175838 0.0293356 0.0586796 0.002277 0.0603928 -0.0631068 0.0333978 0.0042436 -0.1680235 0.0432788 0.0354664 0.0040183 0.0076842 -0.0646731 -0.0116036 -0.0942837 -0.0485139 0.0865898 -0.0398756 -0.0718457 -0.009878 -0.0145213 0.268337 0.0390501 0.1484402 0.0150115 0.2399169 -0.1311279 0.1207367 -0.072662 0.3669772 0.353699 -0.0123132 0.0532323 -0.0173069 0.2225193 0.0819859 0.0679924 0.1344705 0.2096973 0.3383116 -0.1303327 -0.1323971 -0.1162499 0.2650492 -0.0057517 -0.1295356 0.0006475 0.2657778 0.26474 -0.0022609 0.0083732 -0.0202342 0.3537304 -0.0781551 0.0291109 -0.062721 0.2500189 0.1924463 0.0387879 0.020345 0.0148063 0.348904 -0.0726629 -0.0023287 -0.0689388 0.1981562 unknown
polarizability: 70.7290622|-3.9804349|51.2407761|2.2687583|3.2225837|66.0616126 unknown
InChI: InChI=1S/C4H9NO4/c5-4(9)3(8)2(7)1-6/h2-3,6-8H,1,5H2
charge 0 multiplicity 1
18 atoms
O  -0.383016 0.762515 -1.458341
O  0.127742 0.518427 1.485444
O  -2.666128 -0.161467 1.271305
O  1.510324 -1.477037 -1.199203
N  2.400774 -0.888704 0.877105
C  -0.985999 -0.274157 -0.600804
C  -0.013547 -0.617877 0.544435
C  -2.30384 0.33966 -0.058366
C  1.367348 -1.036335 -0.014856
H  -1.17235 -1.199297 -1.178245
H  -0.429677 -1.43835 1.15424
H  -2.190871 1.442863 -0.062301
H  -3.148058 0.073564 -0.712054
H  0.307387 0.312729 -2.015995
H  0.273061 1.330001 0.927316
H  -1.996153 0.203391 1.910406
H  2.22202 -0.450536 1.781972
H  3.346384 -1.149991 0.599643
