program: Gaussian 09
title: 000255944
version: EM64L-G09RevD.01
frameworkgroup: C1[X(C12H19NO5)]
method: RPBEPBE
basis: SDD
operation: Freq
keyword: #p
keyword: freq=noraman
keyword: PBEPBE/SDD
title: #p freq=noraman PBEPBE/SDD
converged: YES YES NO NO
title: Mulliken charges:
elementType: O O O O O N C C C C C C C C C C C C H H H H H H H H H H H H H H H H H H H
charge: -0.257731 -0.264437 -0.233994 -0.236326 -0.207660 -0.407693 -0.098950 0.107588 -0.583716 -0.398674 0.143034 0.214113 0.235149 -0.713951 -0.256413 -0.266688 -0.662941 -0.659890 0.249926 0.260438 0.252290 0.209306 0.235951 0.339343 0.221172 0.228813 0.212964 0.238482 0.226274 0.237440 0.226007 0.221717 0.254515 0.227230 0.233823 0.253108 0.220382
chargesum: 0.00000
title: Mulliken charges with hydrogens summed into heavy atoms:
elementType: O O O O O N C C C C C C C C C C C C
charge: -0.257731 -0.264437 -0.233994 -0.236326 -0.207660 -0.068350 0.150976 0.107588 -0.070989 0.046583 0.143034 0.214113 0.235149 -0.051002 0.208342 0.196759 0.040520 0.047424
polarizability: 1.65840945e+02 -1.42856093e+00 1.44578446e+02 -7.51888816e+00 -2.67090626e+00 1.41215747e+02
1716.lowfreq: -10.6342 -9.2884 -7.4897 -0.0007 0.0006 0.0009 19.8332 34.8477 42.8397
frequency: 19.3268 34.7386 42.8036 53.7568 61.6079 79.4762 89.2702 99.0620 102.2613 130.4156 136.0598 149.7528 190.9706 204.2062 216.8249 231.9542 273.9127 282.8520 304.1869 320.3095 326.5565 338.4084 398.1329 427.4119 437.2913 449.3210 499.1083 548.6716 571.4970 620.5920 650.2999 717.2470 725.9773 731.0566 744.1607 786.1177 803.2418 813.4173 817.4572 823.9481 873.1635 914.5475 929.4306 972.1361 974.3439 999.7877 1010.3723 1037.1483 1067.3793 1094.7509 1095.6946 1106.8519 1126.0453 1135.0725 1151.8301 1156.7595 1157.4378 1174.4964 1216.7474 1252.3451 1269.3016 1275.7593 1275.7791 1278.1323 1295.0034 1321.9798 1351.2453 1352.9802 1354.3456 1371.9766 1391.3574 1391.6243 1393.4679 1445.6909 1456.8539 1457.3106 1462.5354 1462.9564 1469.2954 1478.7699 1483.5448 1484.4921 1485.9184 1619.5711 1637.9235 1674.2515 2976.5994 2978.1506 2994.8403 2996.2235 3009.0072 3017.8321 3031.8609 3034.7648 3042.6153 3074.3957 3079.3944 3089.7092 3091.7572 3096.2978 3097.4124 3098.0451 3123.4749 3124.0558 3559.8265
redmass: 4.0822 3.6039 3.5522 2.9726 5.8153 2.5389 3.7620 5.4785 2.6127 3.4502 3.7318 3.1611 1.8780 1.3185 1.3830 1.4504 2.7056 4.2610 2.9309 4.1038 5.8546 5.2487 3.6941 4.0317 3.5360 3.6223 2.2124 3.4466 3.1713 4.3659 1.9605 4.7428 3.9931 5.0742 3.0636 1.2802 2.0197 1.8033 1.5129 2.9314 3.4805 2.7836 1.7571 3.0096 1.8311 2.4917 3.0011 4.3925 2.3779 2.1914 2.1696 1.9066 4.9513 3.3183 2.5158 1.7291 1.7004 1.9736 2.9465 1.6220 2.3637 1.1326 1.1220 1.2899 1.3530 1.4195 1.2946 1.4828 1.3040 2.0404 1.2314 1.2280 1.2092 1.0921 1.0933 1.0976 1.0434 1.0447 1.0705 1.0438 1.0521 1.0522 1.0612 10.0351 10.3959 9.1897 1.0633 1.0360 1.0361 1.0362 1.0811 1.0657 1.0599 1.0595 1.0986 1.1003 1.0996 1.0975 1.0975 1.0993 1.1030 1.1030 1.1068 1.1061 1.0787
irintensity: 0.2375 1.0524 1.1874 0.3216 0.5701 0.4395 0.4867 0.1308 0.5791 1.3912 0.6946 0.3239 0.1369 3.3840 4.3422 0.2229 4.9802 8.3657 2.8426 9.4260 11.4846 5.7766 6.3720 4.3097 3.7014 7.7819 10.5286 3.4598 25.4849 3.8269 114.2334 14.5489 18.0495 10.1689 7.8585 4.2265 5.2617 10.3562 5.7765 7.4882 1.1917 6.3703 7.9078 9.4452 3.8742 25.7913 86.1755 67.0902 22.5660 21.0250 22.8600 47.3173 234.9792 50.2440 46.5489 19.0041 23.3197 109.8213 137.5931 34.2996 90.6991 7.9851 3.8877 13.6546 0.4839 12.4069 0.8730 1.7688 3.3556 41.5670 23.7045 25.1381 14.5809 11.8199 12.5957 13.5144 14.6823 14.2064 6.5682 8.8578 12.3384 14.2286 11.6636 164.2094 153.5191 465.2775 20.1933 31.6596 17.3041 15.7182 10.8661 9.5274 24.5712 25.8850 3.2373 48.1412 41.2410 30.8737 30.3859 11.7059 1.5631 0.6004 26.0694 26.6175 41.3964
temp: 298.150 k
press: 1.00000 atm
elementType: 8 8 8 8 8 7 6 6 6 6 6 6 6 6 6 6 6 6 1 1 1 1 1 1 1 1 1 1 1 1 1 1 1 1 1 1 1
symmnumber: 1
zpe: 790482.4 jmol-1
zpe.correction: 0.301079 hartree
zpe.thermalcorrener: 0.321387 hartree
zpe.thermalcorrenthalpy: 0.322331 hartree
zpe.thermalcorrgfe: 0.250215 hartree
zpe.sumelectzpe: -898.163212 hartree
zpe.sumelectthermal: -898.142904 hartree
zpe.sumelectthermalent: -898.141960 hartree
zpe.sumelectthermalfe: -898.214076 hartree
dipole: -5.5276 -0.6989 5.0056
dipole: 7.4899
quadrupole: -114.4253 -95.3602 -114.0443
quadrupole: -2.5649 9.4437 -0.0901
quadrupole: -6.4820 12.5831 -6.1010 -2.5649 9.4437 -0.0901
hfenergy: -898.4642913 hartree
pointgroup: C01 [X(C12H19N1O5)]
dipole: -2.4523366 0.2917304 -1.6075513 debye
polarizability: 167.5706567|0.8160069|144.5528191|3.345236|-2.8974426|139.5116623 unknown
InChI: InChI=1S/C12H19NO5/c1-4-8-7-9(14)13-12(8,10(15)17-5-2)11(16)18-6-3/h8,13H,4-7H2,1-3H3
charge 0 multiplicity 1
37 atoms
O  -1.677027 1.607725 -0.346494
O  -1.565745 -1.507859 -0.385578
O  3.493969 0.357818 1.563123
O  -1.526221 0.837544 1.849348
O  0.594169 -2.3278 -0.05441
N  1.164231 0.170486 1.272004
C  0.922813 0.714354 -1.032636
C  0.154137 0.10248 0.214159
C  2.412475 0.429572 -0.704151
C  0.447889 0.219399 -2.414225
C  2.4757 0.321198 0.826972
C  -1.098986 0.875074 0.671995
C  -0.222367 -1.38335 -0.069471
C  1.153898 0.962387 -3.569182
C  -2.918697 2.37524 0.006287
C  -2.06463 -2.892457 -0.686931
C  -2.558284 3.743715 0.588259
C  -2.413563 -3.628653 0.608134
H  0.7493 1.806143 -0.980151
H  2.748889 -0.532796 -1.133542
H  3.097794 1.217438 -1.054032
H  0.642091 -0.868223 -2.506622
H  -0.645406 0.366263 -2.493121
H  0.920826 0.028254 2.254282
H  0.78716 0.606082 -4.54861
H  2.24779 0.805671 -3.54393
H  0.9662 2.051333 -3.51491
H  -3.505077 1.772092 0.720896
H  -3.449249 2.4546 -0.955569
H  -1.284232 -3.423534 -1.259611
H  -2.948348 -2.711852 -1.31868
H  -3.482097 4.324377 0.767334
H  -2.030059 3.634118 1.549819
H  -1.922328 4.31614 -0.108774
H  -3.144591 -3.055506 1.203434
H  -1.511077 -3.800278 1.217819
H  -2.857647 -4.611896 0.366063
