program: Gaussian 09
title: 000255943
version: EM64L-G09RevD.01
frameworkgroup: C1[X(C10H19NO4)]
method: RPBEPBE
basis: SDD
operation: Freq
keyword: #p
keyword: freq=noraman
keyword: PBEPBE/SDD
title: #p freq=noraman PBEPBE/SDD
converged: YES YES NO NO
title: Mulliken charges:
elementType: O O O O N C C C C C C C C C C H H H H H H H H H H H H H H H H H H H
charge: -0.417744 -0.415091 -0.233268 -0.243892 -0.585582 0.031849 -0.438998 -0.381274 -0.308038 -0.546905 -0.353417 -0.358143 0.139881 0.184238 -0.696488 0.243587 0.198734 0.214930 0.196975 0.186894 0.311339 0.263030 0.277517 0.189237 0.191851 0.196845 0.193794 0.281606 0.287769 0.215810 0.211153 0.210026 0.375468 0.376306
chargesum: 0.00000
title: Mulliken charges with hydrogens summed into heavy atoms:
elementType: O O O O N C C C C C C C C C C
charge: -0.042275 -0.038786 -0.233268 -0.243892 -0.016207 0.275436 -0.025335 0.002594 0.003302 -0.006357 0.027672 0.032496 0.139881 0.184238 -0.059499
polarizability: 1.42514586e+02 7.04075609e+00 1.25878045e+02 2.44019308e-01 -4.27546050e+00 1.14115206e+02
1716.lowfreq: -36.7111 -14.7289 -8.0440 -0.0009 -0.0007 0.0006 6.9379 24.6998 33.8312
frequency: -34.7441 23.9369 33.4130 41.8552 47.6301 55.8154 101.8201 103.3724 118.9129 140.6311 163.9912 175.7019 205.9592 217.3148 229.8406 276.7549 315.1228 322.4301 356.5843 423.4267 446.7159 472.2984 499.4603 535.0440 592.1664 611.4173 640.0753 641.8508 649.1985 709.4617 720.0923 742.3425 779.8044 816.8655 861.1048 869.3828 890.6897 932.4359 993.3532 998.4527 1026.3235 1038.6143 1044.3418 1059.9923 1077.6099 1083.3872 1108.7786 1120.2790 1152.3552 1177.1988 1198.6111 1204.9288 1221.5755 1238.6579 1251.5777 1262.3630 1273.1409 1288.5035 1291.9603 1305.5956 1317.5798 1332.6122 1350.9069 1356.7675 1368.2290 1387.8942 1397.6955 1426.4482 1453.8769 1461.3164 1467.8915 1477.2630 1477.9399 1486.7108 1643.9581 1656.5079 1661.3461 2952.1135 2955.5622 2962.1910 2968.0020 2972.0931 2989.8874 3002.9674 3005.6847 3011.5880 3027.2847 3043.4495 3054.9559 3055.9870 3068.7608 3071.0452 3468.9362 3487.1710 3509.5123 3595.1702
redmass: 1.6753 6.2469 4.3968 4.4530 6.9266 7.2405 3.2423 1.7807 3.3709 3.4397 1.3885 3.5318 2.6355 3.2154 1.1089 4.1102 3.9823 3.4977 3.3353 3.5614 3.3326 2.6538 2.2420 3.1720 3.3954 2.0583 1.9913 1.4093 1.4511 3.7008 1.0783 1.1732 3.7559 1.4235 2.5742 2.8018 1.8222 1.5558 1.9126 3.3411 3.1150 2.4431 2.5152 1.8033 2.3953 2.1067 2.0003 2.7861 2.3582 1.4634 1.4429 1.4010 1.3605 1.3930 1.4028 1.5208 1.3650 1.0750 1.2345 1.3337 1.2579 1.4056 1.5692 1.5462 1.8680 1.2154 1.3611 1.0923 1.0806 1.0700 1.0782 1.0431 1.0752 1.0831 2.3306 1.7198 6.6046 1.0584 1.0593 1.0628 1.0597 1.0363 1.0965 1.0642 1.0958 1.0839 1.1020 1.1022 1.0858 1.0964 1.1007 1.0993 1.0457 1.0638 1.0639 1.0973
irintensity: 0.0402 0.1936 0.6455 0.2260 0.9129 0.8535 1.1204 0.0038 0.5855 4.0090 41.9519 1.9288 1.5967 0.3008 0.0037 11.4536 1.9577 1.9473 6.9798 27.7403 18.4577 16.5738 13.6809 19.3025 28.5037 67.7590 79.9417 125.0213 198.1349 59.7908 14.0782 1.5997 4.7731 5.7593 17.3616 3.7620 6.9229 10.9279 22.4217 8.2645 55.6314 274.9240 24.2737 138.2151 4.0333 5.6885 7.6607 29.4564 14.1031 10.6604 9.6695 7.1377 1.6996 3.9192 1.8372 8.8332 9.0129 2.2402 8.6454 5.1852 6.5386 10.7574 5.0995 8.0437 57.8842 10.7473 7.6261 33.0962 0.6195 0.3750 0.6172 11.9929 4.7503 17.1747 222.6695 67.9251 172.2875 1.0723 4.9792 8.4226 117.4423 36.9470 1.9959 16.7150 1.6454 8.9506 10.3054 86.0393 3.4874 8.9608 90.5391 53.7179 2.4836 12.3736 22.1633 8.8612
temp: 298.150 k
press: 1.00000 atm
elementType: 8 8 8 8 7 6 6 6 6 6 6 6 6 6 6 1 1 1 1 1 1 1 1 1 1 1 1 1 1 1 1 1 1 1
symmnumber: 1
zpe: 748322.9 jmol-1
zpe.correction: 0.285021 hartree
zpe.thermalcorrener: 0.302601 hartree
zpe.thermalcorrenthalpy: 0.303545 hartree
zpe.thermalcorrgfe: 0.237145 hartree
zpe.sumelectzpe: -746.911377 hartree
zpe.sumelectthermal: -746.893797 hartree
zpe.sumelectthermalent: -746.892853 hartree
zpe.sumelectthermalfe: -746.959253 hartree
dipole: 0.2887 0.7563 -1.3696
dipole: 1.5909
quadrupole: -86.8228 -92.2252 -91.4923
quadrupole: -0.8748 -4.7989 -3.1011
quadrupole: 3.3573 -2.0451 -1.3122 -0.8748 -4.7989 -3.1011
hfenergy: -747.196398 hartree
pointgroup: C01 [X(C10H19N1O4)]
dipole: 0.1158901 0.2823304 -0.5464734 debye
polarizability: 142.2107092|7.4519796|125.8856563|0.5219273|-4.5340104|114.4114717 unknown
InChI: InChI=1S/C10H19NO4/c1-2-3-4-5-7(6-8(12)13)9(11)10(14)15/h7,9,12,14H,2-6,11H2,1H3
charge 0 multiplicity 1
34 atoms
O  2.687703 -1.066135 -1.362208
O  2.426067 3.081709 -0.806932
O  1.411957 -2.902238 -0.745757
O  2.708337 1.934182 1.185625
N  1.170592 -1.858647 1.903397
C  0.455514 0.13349 0.558632
C  -0.886372 -0.491653 0.098112
C  -2.105121 0.45107 0.2368
C  1.561332 -0.963713 0.805404
C  0.911544 1.259406 -0.396807
C  -3.437258 -0.233012 -0.146529
C  -4.661749 0.700578 -0.009536
C  1.851308 -1.761991 -0.473211
C  2.084989 2.0738 0.108408
C  -5.989192 0.014999 -0.398804
H  0.310235 0.563313 1.568925
H  -0.806933 -0.837444 -0.95422
H  -1.079401 -1.391923 0.713052
H  -2.166642 0.81173 1.284738
H  -1.975479 1.35216 -0.397871
H  2.478428 -0.420134 1.089718
H  0.080314 1.968098 -0.572817
H  1.18677 0.863409 -1.391992
H  -3.374371 -0.602965 -1.191445
H  -3.586246 -1.129095 0.49129
H  -4.724922 1.066188 1.035795
H  -4.508163 1.597904 -0.643579
H  1.940931 -2.11647 2.5249
H  0.635886 -2.676736 1.593355
H  -6.848227 0.702201 -0.288752
H  -6.180337 -0.869475 0.237876
H  -5.964115 -0.329132 -1.450104
H  2.842665 -1.623456 -2.174235
H  3.200352 3.595676 -0.448632
