program: Gaussian 09
title: 000250546
version: EM64L-G09RevD.01
frameworkgroup: C1[X(C17H16O3)]
method: RPBEPBE
basis: SDD
operation: Freq
keyword: #pfreq=noraman
keyword: PBEPBE/SDD
title: #p freq=noraman PBEPBE/SDD
converged: YES YES NO NO
title: Mulliken charges:
elementType: O O O C C C C C C C C C C C C C C C C C H H H H H H H H H H H H H H H H
charge: -0.278373 -0.258992 -0.232888 0.242420 -0.287439 0.380179 -0.761280 0.293119 -0.395578 -0.348052 -0.233276 -0.230599 -0.484238 -0.242741 0.479447 -0.400534 -0.355016 -0.224535 -0.227091 -0.234723 0.247457 0.221481 0.237924 0.245854 0.222900 0.279806 0.224594 0.229303 0.247208 0.226723 0.228397 0.232368 0.268865 0.227765 0.229742 0.229801
chargesum: 0.00000
title: Mulliken charges with hydrogens summed into heavy atoms:
elementType: O O O C C C C C C C C C C C C C C C C C
charge: -0.278373 -0.258992 -0.232888 0.242420 -0.039982 0.380179 -0.056021 0.293119 -0.172678 -0.068246 -0.008681 -0.001296 -0.010306 -0.014343 0.479447 -0.168166 -0.086152 0.003230 0.002651 -0.004922
polarizability: 1.74095381e+02 -5.34943799e+00 2.06392604e+02 -2.52110307e+01 -5.18374930e+00 1.56274109e+02
1716.lowfreq: -5.3083 -3.4575 -0.0001 0.0003 0.0007 10.2989 13.0524 24.0447 31.4499
frequency: 12.1280 23.9144 31.3338 40.3832 61.1230 78.8082 117.0995 149.2355 175.1732 194.6790 210.5633 232.2215 264.4063 282.9804 326.2606 354.0449 374.5509 402.8048 403.4500 418.3673 445.4465 490.5353 513.1659 548.2901 592.2920 614.8608 616.9896 651.1860 680.7567 692.7314 703.1545 705.1473 745.9499 758.3885 772.1529 815.9167 830.8926 848.8911 853.9263 859.1517 907.6283 927.2931 935.6592 978.5950 980.2805 984.2715 989.6137 990.1726 997.8663 1001.0102 1003.8671 1017.9428 1026.8267 1027.5781 1061.2455 1088.6231 1091.9438 1092.5279 1124.4070 1172.6820 1173.4230 1190.2222 1190.9289 1222.0906 1233.9437 1236.5280 1314.6576 1317.3881 1329.6854 1343.5481 1370.2314 1380.7223 1385.5033 1394.3203 1435.3319 1442.2995 1462.3678 1462.7960 1466.9472 1484.6527 1486.0534 1589.2155 1594.1907 1614.1535 1614.7587 1642.5685 2994.2972 3035.7211 3089.0017 3103.2659 3112.1117 3113.2564 3120.1357 3123.3576 3128.8289 3133.1046 3140.2523 3145.8998 3151.2252 3160.3045 3165.4349 3177.3132
redmass: 5.5747 4.4647 3.9911 4.0827 5.3742 6.5769 3.8871 4.9157 1.4775 4.7955 2.7959 3.9466 5.3575 4.2761 3.3196 3.4437 5.3478 2.8167 2.8331 3.3940 4.2085 4.1074 4.9348 3.6509 4.5436 6.4496 6.3007 5.9477 5.7883 6.0164 1.7519 1.8447 3.1281 2.5674 1.9200 3.6048 4.7992 4.7196 1.2817 1.2967 3.4631 1.4450 1.5454 1.4048 1.7908 1.4494 5.6869 5.4482 1.4297 1.3529 2.4945 1.6883 2.2013 1.9479 1.7277 1.6569 1.5591 1.7336 3.2017 1.0523 1.0539 1.1223 1.1147 2.7087 1.1738 2.6160 2.7226 1.3600 1.2615 1.3129 2.2559 7.3731 7.7881 1.2155 2.2250 2.1866 1.0643 1.1203 1.1072 2.3008 2.1803 6.1334 6.0718 6.0717 6.0602 10.2453 1.0359 1.0590 1.0987 1.1004 1.0887 1.1065 1.0868 1.0847 1.0875 1.0886 1.0919 1.0938 1.0965 1.0986 1.1016 1.0967
irintensity: 0.0559 0.2638 0.0245 0.2313 1.2511 1.4339 1.7403 0.9182 0.7069 6.0647 0.7716 3.4937 0.6831 1.2187 1.4134 3.3031 3.9875 0.1624 0.0453 3.5279 3.9002 6.1394 20.1498 8.6166 24.9368 0.1096 0.3766 15.8039 6.6827 10.3370 94.6741 24.6302 39.3305 38.9508 42.3294 10.1137 3.8767 23.8249 0.3728 0.8741 44.4778 9.5632 1.6946 2.9999 1.6914 0.1698 3.5907 1.3880 14.5357 0.6368 67.2946 36.7214 7.2400 12.2255 83.4086 3.9262 7.4972 2.3209 274.0024 0.0404 0.0547 0.2402 0.9829 18.3478 5.4775 10.7837 38.2869 4.3116 1.8974 4.7390 72.3883 9.3635 1.3077 18.1221 16.6653 8.7159 9.8774 19.7546 5.5985 6.9816 10.2593 0.9502 1.4906 0.5441 0.3117 108.8489 14.0140 33.5060 14.3893 16.4145 13.1126 4.7819 5.6527 0.5807 3.1305 5.9827 15.5030 34.4061 27.7648 20.1576 18.7643 5.6021
temp: 298.150 k
press: 1.00000 atm
elementType: 8 8 8 6 6 6 6 6 6 6 6 6 6 6 6 6 6 6 6 6 1 1 1 1 1 1 1 1 1 1 1 1 1 1 1 1
symmnumber: 1
zpe: 745066.7 jmol-1
zpe.correction: 0.283781 hartree
zpe.thermalcorrener: 0.301707 hartree
zpe.thermalcorrenthalpy: 0.302651 hartree
zpe.thermalcorrgfe: 0.234676 hartree
zpe.sumelectzpe: -881.613896 hartree
zpe.sumelectthermal: -881.595970 hartree
zpe.sumelectthermalent: -881.595026 hartree
zpe.sumelectthermalfe: -881.663001 hartree
dipole: -2.1116 1.1055 2.7131
dipole: 3.6113
quadrupole: -114.5435 -105.9885 -113.2473
quadrupole: 4.1444 1.3858 -3.8750
quadrupole: -3.2837 5.2713 -1.9875 4.1444 1.3858 -3.8750
hfenergy: -881.8976765 hartree
pointgroup: C01 [X(C17H16O3)]
dipole: 0.9963919 -0.1864621 0.9955494 debye
polarizability: 181.5635104|-0.4024799|206.1168888|21.8149863|-6.4780529|149.0816949 unknown
InChI: InChI=1S/C17H16O3/c1-17(14-10-6-3-7-11-14)15(20-17)16(18)19-12-13-8-4-2-5-9-13/h2-11,15H,12H2,1H3
charge 0 multiplicity 1
36 atoms
O  -2.91394 1.859099 -0.329045
O  0.778552 2.129669 -0.709357
O  -0.670901 0.754633 -1.938535
C  -2.310334 1.13701 0.855726
C  -1.468334 2.073126 -0.012199
C  -2.206754 -0.361693 0.715824
C  -2.763519 1.681848 2.203588
C  -0.465169 1.559777 -1.004871
C  -1.603707 -1.131817 1.744695
C  -2.722362 -1.019319 -0.428707
C  -1.516821 -2.536388 1.629011
C  -2.643464 -2.424671 -0.537332
C  1.942453 1.666811 -1.556013
C  -2.04077 -3.188585 0.488626
C  2.678284 0.525671 -0.890188
C  3.877913 0.766273 -0.174287
C  2.174448 -0.799457 -0.973084
C  4.566005 -0.297341 0.451995
C  2.858018 -1.861098 -0.342016
C  4.055839 -1.613629 0.37014
H  -1.221637 3.055182 0.410383
H  -2.02662 1.455544 2.994584
H  -2.892725 2.775831 2.151156
H  -3.727742 1.228427 2.491674
H  -1.19109 -0.640463 2.633176
H  -3.171753 -0.416697 -1.222671
H  -1.043253 -3.119128 2.42707
H  -3.048746 -2.921819 -1.425564
H  1.538981 1.380115 -2.542659
H  2.5663 2.570322 -1.637082
H  -1.979989 -4.279379 0.401695
H  4.272366 1.787759 -0.106032
H  1.245578 -0.988423 -1.52329
H  5.494442 -0.101539 0.999974
H  2.459239 -2.879376 -0.408038
H  4.58801 -2.439675 0.855457
