program: Gaussian 09
title: 000250539
version: EM64L-G09RevD.01
frameworkgroup: C1[X(C15H18O3)]
method: RPBEPBE
basis: SDD
operation: Freq
keyword: #pfreq=noraman
keyword: PBEPBE/SDD
title: #p freq=noraman PBEPBE/SDD
converged: YES YES NO NO
title: Mulliken charges:
elementType: O O O C C C C C C C C C C C C C C C H H H H H H H H H H H H H H H H H H
charge: -0.305579 -0.245155 -0.216603 0.236830 -0.449466 -0.353137 -0.750286 0.024963 0.081907 0.270523 -0.283132 -0.347513 -0.321805 -0.134794 -0.239314 -0.261056 -0.228298 -0.735866 0.251556 0.227415 0.197394 0.236269 0.200316 0.242732 0.264794 0.195860 0.248368 0.276911 0.290904 0.255673 0.231254 0.230780 0.231247 0.225999 0.225917 0.224393
chargesum: 0.00000
title: Mulliken charges with hydrogens summed into heavy atoms:
elementType: O O O C C C C C C C C C C C C C C C
charge: -0.305579 -0.245155 -0.216603 0.236830 0.029504 0.080527 -0.042444 0.220823 0.081907 0.270523 -0.034764 -0.070602 -0.030901 0.120879 -0.008059 -0.030277 0.002948 -0.059557
polarizability: 1.96336961e+02 -2.16501537e+00 1.96032876e+02 -1.09378902e+01 1.44536714e+01 1.17647960e+02
1716.lowfreq: -10.5205 -0.4507 -0.0003 0.0002 0.0006 7.2074 26.7018 37.0353 44.3154
frequency: 26.2656 36.9900 44.1972 88.6910 104.2050 113.6345 137.0097 154.5781 186.9706 192.6228 194.9855 222.9155 244.5229 292.4360 306.2711 324.9790 352.9268 382.0519 397.1930 402.8830 412.3255 452.3868 476.9930 531.1688 597.5728 615.0445 626.9765 661.2919 686.2268 693.4398 703.6961 762.1706 789.4997 806.9049 849.4416 863.6647 870.9421 884.8950 916.5620 932.8497 947.9522 957.3185 975.1606 985.0420 990.0239 996.7403 1008.9510 1010.3453 1030.6829 1036.1562 1049.6906 1087.8017 1110.0747 1114.9416 1120.0331 1148.6239 1158.3020 1173.3516 1192.4404 1216.5157 1238.2233 1267.8356 1273.6166 1294.3333 1305.8461 1322.0041 1336.9988 1345.6119 1364.1853 1384.4390 1385.1850 1394.2413 1434.2700 1447.8675 1461.4638 1464.0179 1464.4145 1470.4969 1474.8609 1479.3775 1552.1122 1587.3517 1608.8499 1698.2620 2897.8219 2961.0324 2967.9491 3004.1513 3010.8910 3042.4925 3074.4790 3079.6169 3088.7883 3099.5758 3113.1235 3121.6086 3126.8176 3131.3498 3140.2250 3154.0027 3165.8829 3191.4523
redmass: 5.3192 4.2086 3.6705 3.2745 2.1380 3.4551 3.1709 1.2018 2.7645 2.8817 1.6334 3.4152 3.9377 3.2941 2.9798 3.3354 2.7252 4.5695 3.7298 2.9177 4.6462 3.4362 3.6093 5.2379 5.1869 6.3596 4.0815 3.3255 4.2880 3.0900 1.6557 2.0242 2.3104 2.9417 2.8579 1.2735 2.9595 4.5968 3.1565 1.8861 2.2478 1.4276 2.3070 1.0914 4.5234 1.4814 1.4307 1.8969 2.0909 3.1907 1.5608 1.5771 2.2179 2.7930 2.0869 2.3290 2.4006 1.0641 1.1312 1.3469 1.5629 2.8993 1.3469 1.2445 1.2227 1.3179 1.3431 1.4682 1.3870 1.2119 8.3831 1.2339 2.3070 1.0882 1.0474 1.0657 1.0750 1.0587 2.1273 1.0748 8.2024 6.5802 6.1819 6.3821 1.0810 1.0679 1.0366 1.0363 1.0595 1.0967 1.1006 1.0984 1.0982 1.0999 1.0988 1.0954 1.0854 1.0872 1.0896 1.0944 1.0989 1.0946
irintensity: 2.7203 1.0474 0.0949 2.8245 1.4915 1.2336 0.8288 0.1489 2.0200 3.5557 0.3311 0.8357 0.4682 1.2563 0.3742 0.7464 1.7046 8.3258 4.0946 1.0282 1.3690 1.9506 3.8495 12.4895 10.7014 0.5485 3.6914 14.8757 1.0841 3.2439 78.9636 4.7254 21.6271 10.4985 50.6864 1.1777 26.9190 84.8864 56.5009 6.4796 78.8444 3.6498 13.7720 60.5156 2.7901 3.1043 2.8477 6.7216 3.3178 64.9721 0.2321 3.7682 36.1259 45.3885 11.1037 23.2772 77.6471 0.7162 25.2239 62.6960 23.3585 87.5356 8.2011 4.4931 10.5356 1.4662 5.5229 33.9511 4.8631 51.2940 6.4498 12.1206 17.9350 7.5566 14.6907 11.4523 12.1096 21.9637 1.6031 16.1571 121.1919 23.4837 12.4184 17.9064 65.8280 63.8582 34.9438 30.4808 12.8937 24.6405 20.3223 20.2211 30.8293 22.6445 8.4397 3.1892 0.6875 18.2649 15.6717 14.6071 25.7218 9.5237
temp: 298.150 k
press: 1.00000 atm
elementType: 8 8 8 6 6 6 6 6 6 6 6 6 6 6 6 6 6 6 1 1 1 1 1 1 1 1 1 1 1 1 1 1 1 1 1 1
symmnumber: 1
zpe: 772055.8 jmol-1
zpe.correction: 0.294061 hartree
zpe.thermalcorrener: 0.311567 hartree
zpe.thermalcorrenthalpy: 0.312511 hartree
zpe.thermalcorrgfe: 0.247964 hartree
zpe.sumelectzpe: -806.682384 hartree
zpe.sumelectthermal: -806.664877 hartree
zpe.sumelectthermalent: -806.663933 hartree
zpe.sumelectthermalfe: -806.728480 hartree
dipole: -1.5995 0.8374 1.3567
dipole: 2.2584
quadrupole: -101.8680 -98.4176 -106.6085
quadrupole: 8.3932 2.8191 -2.7370
quadrupole: 0.4300 3.8804 -4.3104 8.3932 2.8191 -2.7370
hfenergy: -806.9764446 hartree
pointgroup: C01 [X(C15H18O3)]
dipole: 0.5901452 -0.5396012 -0.3873323 debye
polarizability: 194.609568|-15.4627333|117.309804|-2.6420038|7.5824571|198.0984245 unknown
InChI: InChI=1S/C15H18O3/c1-3-7-13-17-11-10-15(2,18-13)14(16)12-8-5-4-6-9-12/h3-9,13H,10-11H2,1-2H3
charge 0 multiplicity 1
36 atoms
O  0.839117 0.529244 0.723067
O  2.296017 -1.40923 0.654862
O  -2.204842 0.642615 2.552307
C  0.034894 0.005206 1.8711
C  0.178563 -1.553767 1.931879
C  1.656133 -1.984637 1.857524
C  0.46747 0.68858 3.184439
C  2.236064 0.046796 0.720643
C  -1.463005 0.33363 1.571743
C  -2.057036 0.207648 0.19562
C  2.901437 0.655823 -0.482433
C  -3.433987 0.553877 0.066433
C  -1.35674 -0.261018 -0.95235
C  3.693676 -0.030614 -1.342498
C  -4.093707 0.439743 -1.170876
C  -2.025607 -0.383512 -2.18926
C  -3.390332 -0.033256 -2.305851
C  4.380118 0.571875 -2.545167
H  -0.362085 -2.007852 1.082992
H  -0.280372 -1.925135 2.867054
H  2.220223 -1.671085 2.761621
H  1.746745 -3.076473 1.743174
H  1.434293 0.307178 3.554625
H  0.555657 1.7765 3.023544
H  -0.299419 0.522431 3.957825
H  2.717081 0.374574 1.673582
H  2.704808 1.727178 -0.614518
H  -3.961068 0.907631 0.958493
H  -0.293505 -0.49632 -0.878695
H  3.846834 -1.102935 -1.160145
H  -5.150711 0.715169 -1.255201
H  -1.476681 -0.744897 -3.065727
H  -3.901829 -0.124874 -3.270935
H  4.056202 0.067938 -3.476713
H  4.164316 1.650087 -2.644226
H  5.478272 0.442582 -2.48163
