program: Gaussian 09
title: 000250532
version: EM64L-G09RevD.01
frameworkgroup: C1[X(C14H23NO4)]
method: RPBEPBE
basis: SDD
operation: Freq
keyword: #p
keyword: freq=noraman
keyword: PBEPBE/SDD
title: #p freq=noraman PBEPBE/SDD
converged: YES YES NO NO
title: Mulliken charges:
elementType: O O O O N C C C C C C C C C C C C C C H H H H H H H H H H H H H H H H H H H H H H H
charge: -0.228975 -0.228001 -0.207443 -0.189320 0.112096 -0.148121 -0.050166 -0.053487 0.304698 -0.470502 -0.546462 -0.382373 -0.400453 0.429107 -0.784062 -0.405238 -0.411612 -0.832541 -0.702253 0.235795 0.254202 0.220811 0.233954 0.243612 0.205818 0.205201 0.276874 0.183975 0.186635 0.276900 0.208386 0.224543 0.217982 0.209208 0.239526 0.210689 0.216543 0.227933 0.218889 0.242927 0.226921 0.227782
chargesum: 0.00000
title: Mulliken charges with hydrogens summed into heavy atoms:
elementType: O O O O N C C C C C C C C C C C C C C
charge: -0.228975 -0.228001 -0.207443 -0.189320 0.112096 0.087674 0.204036 0.167324 0.304698 0.007065 -0.135443 0.078477 0.063083 0.429107 -0.133151 -0.196030 0.038603 -0.169176 -0.004623
polarizability: 2.06727583e+02 -2.32967206e+00 1.58835747e+02 5.99330424e+00 -2.51424613e+00 1.37521794e+02
1716.lowfreq: -0.0003 0.0003 0.0004 3.8811 7.9939 13.9725 35.0302 41.0399 50.7252
frequency: 34.9668 40.9654 50.6983 59.1558 75.5183 106.6209 121.5741 142.8877 166.8314 174.9946 178.5992 211.5210 219.0971 229.3069 263.1959 265.0299 275.8923 298.2212 325.0540 357.8960 373.6936 378.1916 405.9968 423.2855 448.0186 461.3730 467.8047 497.4877 521.9234 541.9961 595.9319 608.8668 678.1690 718.5322 764.8079 770.1837 779.3527 795.2759 846.2569 853.2563 871.6851 883.6193 907.8506 916.5992 919.6756 952.3888 959.0615 970.2916 984.7779 1019.0157 1031.2568 1039.5206 1056.0712 1065.8552 1071.2581 1089.2594 1098.2053 1102.7496 1136.0454 1140.8451 1155.9669 1165.8330 1186.4742 1199.2947 1220.3926 1228.7177 1240.2156 1257.7775 1282.2328 1292.3637 1301.1260 1312.8605 1321.0369 1323.2609 1336.2289 1339.4452 1351.6787 1360.2746 1362.4153 1368.2338 1376.0965 1385.4740 1395.7713 1402.2014 1410.2059 1440.9031 1446.1791 1453.5904 1461.6028 1466.1154 1467.4451 1473.3329 1475.4829 1484.7760 1485.5509 1487.2128 1700.9968 2894.7163 2930.9407 2939.4200 2949.0420 2954.3950 2964.7178 2970.1420 2978.0813 2981.0864 2991.6889 2994.2909 3005.4351 3023.4672 3036.0208 3045.7877 3057.1257 3068.6095 3075.4451 3088.7483 3094.2382 3096.9292 3110.2760 3121.2596
redmass: 4.9626 4.2478 5.1638 5.0878 2.5866 3.9391 2.2446 3.4553 2.9957 4.2117 1.2392 2.0630 2.3800 1.4920 2.4026 1.9801 1.8244 2.3370 2.6537 3.6419 2.6022 2.4930 2.8079 2.5860 3.2023 3.6960 3.7098 3.7518 4.6287 5.4804 6.1730 4.2094 4.2408 3.1945 8.2212 2.1113 1.5232 1.4867 2.8636 2.9567 2.9186 2.4183 1.7128 1.7230 2.2396 1.7481 2.2241 5.9044 1.5370 2.3302 1.5643 1.9339 2.0674 2.1596 2.7778 2.2594 2.5153 2.6101 1.4444 2.2192 2.1190 1.9296 1.8102 2.3643 4.9519 1.6033 1.2224 1.2441 1.2521 1.3723 1.4131 1.2896 1.3586 1.2438 1.3092 1.4374 1.4276 1.4019 2.0458 1.6111 1.3119 1.2170 1.2421 1.9098 1.9562 1.1673 1.0862 1.0851 1.0503 1.1024 1.0899 1.0590 1.0579 1.0450 1.0555 1.0459 6.6091 1.0824 1.0632 1.0694 1.0694 1.0379 1.0378 1.0788 1.0696 1.0867 1.0586 1.0376 1.0884 1.0966 1.0965 1.1012 1.0980 1.0989 1.0978 1.0994 1.1007 1.0907 1.0939 1.0927
irintensity: 1.4205 1.3437 0.2349 0.4821 0.2948 0.3180 0.2483 0.6229 0.8966 1.5748 1.1237 0.8197 0.6964 0.4381 2.4042 3.6952 0.8444 1.4130 1.0358 2.6839 9.1463 2.4925 2.7689 3.7636 0.5069 2.1937 0.8947 2.2206 3.5782 9.1030 6.3058 1.8590 0.2868 6.6768 17.4876 14.1637 6.8775 24.3700 9.5106 22.5364 14.2213 37.3119 0.8090 3.9079 4.7601 8.7634 51.6622 19.5661 0.9774 46.4498 0.9939 21.9709 1.8965 6.2114 87.1421 26.9510 7.0154 37.7582 18.5571 11.6662 2.7646 3.8880 10.7166 7.8461 46.8303 10.0224 1.4677 16.1654 1.8748 8.1302 1.9908 4.1858 0.5818 3.9205 4.2135 0.8643 6.2149 16.5148 1.6203 7.9542 7.5230 13.9750 10.4341 114.0064 48.8084 2.7250 9.1670 5.4425 11.8575 9.3353 12.2262 14.5558 6.0603 12.7951 16.1741 12.7747 1.5920 52.8478 38.1550 15.7192 93.0436 59.1842 36.4965 9.2060 9.6183 33.8416 28.2555 16.5001 26.9038 32.6068 15.3658 5.7669 51.2258 50.1282 27.0103 32.9801 27.6727 45.5930 4.0752 4.2223
temp: 298.150 k
press: 1.00000 atm
elementType: 8 8 8 8 7 6 6 6 6 6 6 6 6 6 6 6 6 6 6 1 1 1 1 1 1 1 1 1 1 1 1 1 1 1 1 1 1 1 1 1 1 1
symmnumber: 1
zpe: 930306.4 jmol-1
zpe.correction: 0.354335 hartree
zpe.thermalcorrener: 0.374111 hartree
zpe.thermalcorrenthalpy: 0.375055 hartree
zpe.thermalcorrgfe: 0.306188 hartree
zpe.sumelectzpe: -901.323550 hartree
zpe.sumelectthermal: -901.303774 hartree
zpe.sumelectthermalent: -901.302830 hartree
zpe.sumelectthermalfe: -901.371697 hartree
dipole: 1.3497 5.2342 1.3350
dipole: 5.5679
quadrupole: -102.2390 -118.6819 -118.5734
quadrupole: 12.0708 3.0848 0.3241
quadrupole: 10.9258 -5.5171 -5.4087 12.0708 3.0848 0.3241
hfenergy: -901.6778846 hartree
pointgroup: C01 [X(C14H23N1O4)]
dipole: -0.5304135 2.0796877 -0.4383603 debye
polarizability: 206.9607539|1.9527658|158.6029605|4.71223|3.2281034|137.5214094 unknown
InChI: InChI=1S/C14H23NO4/c1-4-14(15(16)17)8-18-13(19-9-14)12-6-5-10(2)7-11(12)3/h5,11-13H,4,6-9H2,1-3H3
charge 0 multiplicity 1
42 atoms
O  -0.624703 -0.169159 -1.461495
O  -0.402939 0.599657 0.806923
O  -3.304399 -2.082692 -0.515739
O  -2.632925 -1.529426 1.584199
N  -2.864936 -1.245465 0.355611
C  1.59198 0.292199 -0.568615
C  2.475321 1.171427 0.36456
C  0.122146 0.714455 -0.55659
C  -2.700653 0.235696 -0.119848
C  1.746563 -1.207782 -0.206304
C  3.962899 0.788255 0.15807
C  -2.033452 0.225582 -1.519367
C  -1.809978 1.008772 0.877637
C  4.220417 -0.713166 0.125311
C  2.282323 2.690435 0.156702
C  3.19895 -1.600259 -0.024202
C  -4.138855 0.820871 -0.221459
C  5.665577 -1.149479 0.268531
C  -4.940311 0.841345 1.098264
H  1.94299 0.44072 -1.611884
H  2.192628 0.923736 1.407224
H  -0.029986 1.765114 -0.904248
H  1.283834 -1.825714 -0.998312
H  1.170621 -1.420389 0.717463
H  4.56824 1.244731 0.969288
H  4.336743 1.2482 -0.784285
H  -2.528688 -0.499932 -2.18092
H  -2.127847 1.25109 -1.94164
H  -1.907605 2.091931 0.639705
H  -2.112457 0.826171 1.917434
H  2.412947 2.97099 -0.907327
H  1.283643 3.028706 0.487037
H  3.030355 3.256465 0.743043
H  3.420459 -2.677452 -0.020298
H  -4.688503 0.237844 -0.984764
H  -4.042985 1.852983 -0.612073
H  6.302916 -0.681678 -0.509016
H  5.773666 -2.24492 0.182763
H  6.083747 -0.839057 1.247364
H  -5.066711 -0.171473 1.519133
H  -4.457612 1.470289 1.867086
H  -5.947418 1.255181 0.91484
