program: Gaussian 09
title: 000018274
version: EM64L-G09RevD.01
frameworkgroup: C1[X(C9H12O4)]
method: RPBEPBE
basis: SDD
operation: Freq
keyword: #pfreq=noraman
keyword: PBEPBE/SDD
title: #p freq=noraman PBEPBE/SDD
converged: NO YES NO NO
title: Mulliken charges:
elementType: O O O O C C C C C C C C C H H H H H H H H H H H H
charge: -0.206773 -0.206774 -0.206287 -0.206290 0.044108 -0.538941 -0.538948 -0.017535 -0.017536 0.187123 0.187122 -0.702472 -0.702471 0.260598 0.231118 0.260599 0.231118 0.279386 0.279383 0.246609 0.224356 0.220771 0.220772 0.246610 0.224354
chargesum: 0.00000
title: Mulliken charges with hydrogens summed into heavy atoms:
elementType: O O O O C C C C C C C C C
charge: -0.206773 -0.206774 -0.206287 -0.206290 0.044108 -0.047225 -0.047230 0.261851 0.261846 0.187123 0.187122 -0.010736 -0.010735
polarizability: 1.30867802e+02 -1.13414601e+01 9.54454192e+01 -4.25346146e-03 2.02112715e-03 8.44769381e+01
1716.lowfreq: -26.0875 -15.9553 -0.0007 -0.0006 0.0005 5.5655 65.6287 67.3497 119.2394
frequency: 65.5934 66.9250 119.2285 122.6506 142.1196 204.5092 209.0134 241.7531 244.6938 267.7669 298.6203 360.3404 440.5402 461.7591 479.9643 506.2043 583.0362 593.6293 630.4329 657.0069 672.1948 758.0637 774.2016 833.0722 843.6833 898.8814 911.4920 918.1930 950.7581 1001.9677 1037.1517 1039.5104 1059.8003 1082.7162 1125.1496 1145.5187 1147.3663 1157.7108 1185.6536 1197.5151 1236.1312 1290.7678 1295.8012 1315.4405 1316.7554 1355.3929 1359.8917 1395.7269 1395.7696 1452.4669 1452.7766 1461.3422 1461.7551 1477.5547 1477.7547 1674.0757 1687.6647 2992.9651 2993.0667 3010.3979 3013.5754 3050.5869 3050.7174 3088.4460 3088.5814 3094.9149 3095.9252 3107.7248 3107.7682
redmass: 4.2190 3.4025 4.8002 5.2154 7.0563 1.1063 1.0901 3.7831 3.2278 2.3212 3.2022 4.1582 2.4745 2.9249 3.7955 6.1294 3.8949 5.0507 8.0394 6.6881 5.2530 7.6187 3.5318 4.9597 2.9171 2.7286 2.1600 1.4253 1.5997 3.4100 1.6855 4.3824 2.0460 4.3946 2.3095 2.0648 2.0815 2.6621 2.7852 1.4530 1.4326 1.7219 1.4130 1.2675 1.2082 1.5159 1.5291 1.2545 1.2525 1.0880 1.0911 1.0519 1.0519 1.0493 1.0500 12.6372 12.0814 1.0365 1.0365 1.0635 1.0631 1.0871 1.0870 1.0997 1.0994 1.1012 1.1007 1.1004 1.1004
irintensity: 3.0771 4.3694 0.4966 0.1185 5.7696 0.1794 0.0006 0.5278 3.3660 2.3181 8.2532 0.4156 3.5512 0.0236 7.5416 1.9881 6.4546 0.1974 11.2709 1.5745 11.0420 0.6299 5.4032 21.3574 32.5805 34.9720 4.1400 0.4083 91.9468 16.9656 6.1991 388.2078 33.2133 2.3320 98.2031 7.1225 99.3635 0.7111 18.6776 2.1998 4.9485 7.9744 0.1069 15.8587 6.6448 15.4291 0.3854 38.4238 14.8587 4.6471 6.0703 3.4221 23.3823 20.7523 0.0425 450.4465 107.6092 22.6494 7.3408 2.2872 31.3106 2.9374 4.0782 0.1794 19.8949 0.6300 34.3968 27.3693 24.2672
temp: 298.150 k
press: 1.00000 atm
elementType: 8 8 8 8 6 6 6 6 6 6 6 6 6 1 1 1 1 1 1 1 1 1 1 1 1
symmnumber: 1
zpe: 521799.9 jmol-1
zpe.correction: 0.198743 hartree
zpe.thermalcorrener: 0.211189 hartree
zpe.thermalcorrenthalpy: 0.212133 hartree
zpe.thermalcorrgfe: 0.160255 hartree
zpe.sumelectzpe: -650.075262 hartree
zpe.sumelectthermal: -650.062816 hartree
zpe.sumelectthermalent: -650.061872 hartree
zpe.sumelectthermalfe: -650.113750 hartree
dipole: 0.0004 -0.0006 5.7268
dipole: 5.7268
quadrupole: -65.7251 -88.3383 -78.8349
quadrupole: -7.7692 -0.0016 -0.0006
quadrupole: 11.9076 -10.7055 -1.2021 -7.7692 -0.0016 -0.0006
hfenergy: -650.2740052 hartree
pointgroup: C01 [X(C9H12O4)]
dipole: 0.0001446 -0.0002548 2.2531136 debye
dipolederiv: -1.3204741 0.424477 0.2256653 0.2553545 -0.5552971 -0.2221642 0.0027578 -0.1739748 -0.3870637 -1.3205151 0.4245431 -0.2254569 0.255387 -0.5553853 0.222091 -0.0025821 0.1738778 -0.3869403 -0.6936435 0.1921629 0.0762049 0.2532897 -0.8429071 -0.3150191 0.0559627 -0.3385389 -0.4956385 -0.6936646 0.1922205 -0.0761344 0.2533425 -0.8430536 0.3148998 -0.0558868 0.3384376 -0.495469 -0.3361701 -0.2140674 -0.0000091 -0.3854831 -0.3514834 -0.0000091 -0.0000297 -0.000022 -0.0791616 -0.1306102 -0.0091078 -0.1172636 0.0729067 0.0534588 -0.0521357 -0.0637924 -0.040657 0.0520894 -0.130592 -0.0091399 0.1172841 0.0728883 0.0534357 0.0521287 0.063828 0.0406556 0.0520872 0.5320986 -0.0717181 -0.0922402 -0.2786562 0.4886444 0.1405804 -0.1743639 0.1608978 0.3810682 0.5321369 -0.0717553 0.0922097 -0.2787127 0.4887118 -0.1405198 0.1742974 -0.1608573 0.3809712 1.6321013 -0.401189 -0.1628078 -0.1219688 1.049309 0.5173232 0.2709049 0.5615111 0.4494107 1.6320976 -0.4012944 0.1625702 -0.1219662 1.0495584 -0.51716 -0.2710818 -0.5613151 0.4491602 -0.1341282 0.0084944 0.0753037 -0.0053811 0.048316 -0.0141238 0.0527634 -0.0275869 0.0166521 -0.1341462 0.0085101 -0.0752839 -0.005372 0.0483061 0.0141307 -0.0527438 0.0275914 0.0166754 0.0802572 -0.0348046 -0.0169633 -0.0068038 -0.055968 -0.078258 -0.0100327 -0.0327945 0.0668536 0.0425097 -0.0220331 0.0392435 -0.0095825 0.0264915 0.1111573 0.0335407 0.0608834 -0.058253 0.0802623 -0.034801 0.0169506 -0.006794 -0.0559959 0.0782294 0.0100288 0.0327656 0.0668796 0.0425026 -0.0220299 -0.0392605 -0.0095852 0.0265357 -0.1111335 -0.0335562 -0.060859 -0.0582874 0.0645113 -0.0228575 0.0247686 0.0584324 -0.0519217 0.0218094 0.0264159 0.0478538 -0.0303736 0.0644996 -0.0228545 -0.024784 0.058437 -0.05191 -0.0218247 -0.0264111 -0.0478582 -0.0303854 -0.0475705 -0.0162558 -0.0763027 -0.0521944 0.1115985 -0.0063582 -0.1227866 -0.0141139 -0.003739 0.0720915 0.0427378 -0.0250938 -0.02597 -0.0317697 0.1241047 0.0131811 0.106008 0.008779 0.0709554 0.0171465 0.0231787 0.0533025 -0.0642518 -0.1040291 0.0617757 -0.0990341 0.0398307 0.0709421 0.0171709 -0.0231845 0.0533367 -0.0643009 0.103996 -0.0617731 0.0990042 0.0398916 -0.0475432 -0.0162789 0.0763034 -0.0522318 0.1115915 0.0063971 0.1227761 0.0141505 -0.0037547 0.0720914 0.0427239 0.025102 -0.0259752 -0.0317128 -0.1241124 -0.0131922 -0.1060249 0.0087173 unknown
polarizability: 129.8270553|-12.8222973|96.4861663|-0.0041626|0.0022023|84.4769381 unknown
InChI: InChI=1S/C9H12O4/c1-5-3-9(7(10)12-5)4-6(2)13-8(9)11/h5-6H,3-4H2,1-2H3
charge 0 multiplicity 1
25 atoms
O  -2.068685 -0.760137 -0.587957
O  2.068779 0.76042 -0.588034
O  -0.181147 -2.025158 -1.073364
O  0.181181 2.025554 -1.072912
C  0.000113 0.000019 0.40124
C  -1.177805 0.628021 1.177699
C  1.178109 -0.628157 1.177408
C  -2.377683 0.497807 0.205445
C  2.37789 -0.497691 0.205053
C  -0.705017 -1.049043 -0.51031
C  0.70512 1.04931 -0.510139
C  -3.745566 0.32001 0.850838
C  3.745834 -0.320002 0.850343
H  -0.992636 1.680875 1.444654
H  -1.37342 0.049143 2.099453
H  0.992992 -1.681083 1.444115
H  1.373828 -0.049514 2.099287
H  -2.368178 1.321792 -0.528789
H  2.368331 -1.321515 -0.52936
H  -4.523478 0.166972 0.084436
H  -3.749284 -0.547805 1.53339
H  -4.005567 1.225037 1.430321
H  4.005942 -1.225164 1.429567
H  4.523655 -0.16673 0.083896
H  3.749593 0.547639 1.533118
