program: Gaussian 09
title: 000018280
version: EM64L-G09RevD.01
frameworkgroup: C1[X(C8H18O)]
method: RPBEPBE
basis: SDD
operation: Freq
keyword: #pfreq=noraman
keyword: PBEPBE/SDD
title: #p freq=noraman PBEPBE/SDD
converged: NO YES NO NO
title: Mulliken charges:
elementType: O C C C C C C C C H H H H H H H H H H H H H H H H H H
charge: -0.464145 -0.000960 0.278986 -0.044943 -0.810758 -0.751695 -0.752267 -0.743959 -0.739193 0.172480 0.219717 0.213031 0.225432 0.236600 0.201559 0.224535 0.241883 0.213793 0.235387 0.207472 0.201453 0.264269 0.204396 0.214541 0.210107 0.208195 0.334084
chargesum: 0.00000
title: Mulliken charges with hydrogens summed into heavy atoms:
elementType: O C C C C C C C C
charge: -0.130061 0.171520 0.278986 0.174774 -0.135695 -0.083718 -0.095615 -0.073841 -0.106350
polarizability: 9.79591870e+01 8.58467012e-01 8.83008534e+01 -1.24124186e+00 1.11455962e+00 8.45878012e+01
1716.lowfreq: -32.2170 -16.6737 -0.0006 -0.0006 -0.0005 5.5271 49.4276 70.9802 166.2162
frequency: 48.3745 70.6779 166.1966 191.0918 208.5401 226.8834 229.4926 243.2931 272.4753 289.9917 300.2075 314.9591 335.9250 372.7324 388.2642 405.9790 467.8363 517.3260 587.7904 702.1273 773.8201 849.0760 902.6134 914.6555 920.7211 930.5054 957.9909 980.5048 991.6509 1011.3259 1062.6337 1079.8492 1120.6883 1151.7669 1174.6155 1194.0718 1214.5467 1281.3028 1300.4586 1324.6588 1342.5291 1344.8220 1372.9195 1378.7213 1383.9130 1392.0138 1399.6489 1451.6481 1463.4154 1467.1027 1468.6159 1470.3613 1477.1215 1487.1166 1493.5233 1494.3963 1499.0819 2943.1799 2966.2742 2972.9614 2977.2037 2982.4447 2986.2188 2993.6910 3055.2612 3060.2464 3063.5821 3067.9164 3072.0525 3079.7849 3083.3210 3088.5028 3090.8781 3103.3568 3553.6006
redmass: 2.4732 2.3708 1.1295 1.6836 1.1424 1.1495 1.2613 1.3998 1.6331 2.7308 2.8282 2.4611 1.1884 2.2234 2.5445 2.3242 2.8350 2.3488 2.5636 2.9174 2.9069 2.4399 2.2652 1.3756 1.3386 1.6323 1.3328 1.6310 1.3698 1.6418 1.4994 1.7840 1.8668 1.9811 2.4398 1.9739 2.4421 1.4177 1.3767 1.7510 1.4587 1.3576 1.2674 1.2091 1.2220 1.2228 1.2068 1.0531 1.0474 1.0542 1.0528 1.0514 1.0483 1.0513 1.0503 1.0524 1.0515 1.0823 1.0357 1.0368 1.0359 1.0468 1.0703 1.0378 1.0991 1.0992 1.0992 1.0985 1.0980 1.0970 1.0998 1.0995 1.0990 1.0992 1.0655
irintensity: 0.4618 0.0751 0.0539 6.1513 0.2284 0.1912 0.0777 0.0588 19.9650 5.2738 0.0505 2.4123 108.2449 28.7207 4.0968 0.4108 5.6509 3.7290 8.5768 0.7440 7.1485 18.2291 12.1161 3.8991 1.3800 6.4926 0.3399 3.6971 1.0811 5.9872 31.0670 26.7331 34.2883 18.0903 17.6541 1.8885 23.5531 10.0523 15.6308 25.0585 3.4101 0.5187 13.6185 24.4867 38.3048 23.5100 9.3856 3.1860 6.7165 7.6420 9.3459 4.2060 5.8538 7.2654 15.7958 12.2726 13.1053 29.4413 36.2776 31.6792 21.9426 42.4604 2.4817 20.4799 19.2160 33.4871 49.6795 94.6558 26.5799 23.1580 3.4952 26.9054 58.9819 27.6895 3.2494
temp: 298.150 k
press: 1.00000 atm
elementType: 8 6 6 6 6 6 6 6 6 1 1 1 1 1 1 1 1 1 1 1 1 1 1 1 1 1 1
symmnumber: 1
zpe: 640032.3 jmol-1
zpe.correction: 0.243775 hartree
zpe.thermalcorrener: 0.256103 hartree
zpe.thermalcorrenthalpy: 0.257047 hartree
zpe.thermalcorrgfe: 0.206995 hartree
zpe.sumelectzpe: -390.090950 hartree
zpe.sumelectthermal: -390.078622 hartree
zpe.sumelectthermalent: -390.077678 hartree
zpe.sumelectthermalfe: -390.127730 hartree
dipole: -0.1455 1.4946 -0.9707
dipole: 1.7881
quadrupole: -60.3044 -59.3447 -59.1459
quadrupole: 2.4876 -1.2158 3.4354
quadrupole: -0.7061 0.2536 0.4524 2.4876 -1.2158 3.4354
hfenergy: -390.3347253 hartree
pointgroup: C01 [X(C8H18O1)]
dipole: -0.0566724 0.625427 -0.3170447 debye
polarizability: 97.9765338|1.0289464|88.0311938|-0.9632803|1.4947307|84.8401139 unknown
InChI: InChI=1S/C8H18O/c1-6(2)7(3)8(4,5)9/h6-7,9H,1-5H3
charge 0 multiplicity 1
27 atoms
O  1.441983 -0.533016 1.325259
C  -0.166531 0.607665 -0.271318
C  1.236512 -0.094708 -0.086704
C  -1.388146 -0.369277 -0.358949
C  -0.390489 1.720968 0.785157
C  1.377254 -1.399436 -0.892654
C  2.384527 0.872426 -0.475819
C  -1.706919 -1.105874 0.966807
C  -2.651704 0.352741 -0.892317
H  -0.106093 1.105036 -1.265264
H  -1.127633 -1.139031 -1.112871
H  0.447511 2.441161 0.813041
H  -0.51948 1.30091 1.799768
H  -1.300789 2.301534 0.556087
H  1.139661 -1.234311 -1.959132
H  2.413692 -1.771829 -0.815704
H  0.710211 -2.181562 -0.495316
H  2.351936 1.113093 -1.554537
H  3.35581 0.395393 -0.255759
H  2.338041 1.825421 0.083106
H  -2.491019 -1.869154 0.800763
H  -0.811419 -1.598871 1.381214
H  -2.090931 -0.404371 1.731456
H  -3.462418 -0.376834 -1.078398
H  -3.039271 1.093212 -0.167818
H  -2.447548 0.881267 -1.843558
H  1.462453 0.273147 1.901659
