program: Gaussian 09
title: 000255924
version: EM64L-G09RevD.01
frameworkgroup: C1[X(C14H18O7S)]
method: RPBEPBE
basis: SDD
operation: Freq
keyword: #p
keyword: freq=noraman
keyword: PBEPBE/SDD
title: #p freq=noraman PBEPBE/SDD
converged: NO YES NO NO
title: Mulliken charges:
elementType: S O O O O O O O C C C C C C C C C C C C C C H H H H H H H H H H H H H H H H H H
charge: 0.966279 -0.241382 -0.229964 -0.426440 -0.446227 -0.269053 -0.497400 -0.497016 -0.247985 -0.112747 -0.159711 -0.053709 -0.367957 -0.091893 -0.503844 -0.018933 -0.244733 -0.239832 -0.357989 -0.356767 0.453651 -0.796601 0.321465 0.290397 0.268612 0.298941 0.245817 0.261107 0.231495 0.365039 0.236115 0.232457 0.209315 0.284198 0.286168 0.247924 0.248847 0.233313 0.246499 0.232547
chargesum: 0.00000
title: Mulliken charges with hydrogens summed into heavy atoms:
elementType: S O O O O O O O C C C C C C C C C C C C C C
charge: 0.966279 -0.241382 -0.229964 -0.426440 -0.081188 -0.269053 -0.497400 -0.497016 0.073480 0.177650 0.108901 0.245232 0.124645 0.153924 0.174043 -0.018933 0.039464 0.046336 -0.110066 -0.107921 0.453651 -0.084242
polarizability: 2.59400759e+02 1.33842669e+00 1.91826594e+02 -2.50495454e+01 4.18796568e+00 1.55194154e+02
1716.lowfreq: -11.7406 -9.5302 -0.0024 -0.0023 -0.0019 5.5939 9.7460 14.1582 30.2078
frequency: -11.3539 6.2519 30.0917 32.1559 44.0077 68.0163 88.4109 109.8798 124.6237 131.4083 138.9107 156.4635 164.7457 196.0097 213.3408 226.5376 239.5875 275.9706 293.1092 297.3072 315.1510 331.5211 355.2996 379.7944 385.6839 407.4728 409.6658 421.6042 447.7002 492.0503 500.9370 521.8006 542.4328 590.6642 605.5707 620.6705 698.6961 704.4593 728.7168 778.0205 778.3296 809.1463 828.1426 833.0928 835.8717 848.7528 854.3002 875.7455 915.2469 923.8889 949.5052 957.6449 965.5118 981.2666 985.4229 992.4866 992.7361 997.6492 1018.6243 1038.6202 1049.4206 1054.5363 1055.8830 1056.6976 1104.0066 1114.1412 1121.9695 1139.1829 1148.8291 1187.2963 1189.9016 1202.3386 1219.6778 1250.3513 1267.5423 1269.8732 1280.7110 1299.6806 1305.9015 1313.3127 1329.0922 1340.4209 1350.3232 1372.1689 1383.0485 1394.2977 1400.4399 1428.4631 1455.7428 1461.6696 1470.2315 1473.1433 1474.9349 1479.0154 1594.0842 1595.3653 2955.9348 2982.3263 3008.6186 3022.6013 3028.9323 3051.3078 3065.4187 3087.0679 3095.6383 3106.7501 3114.6871 3120.5394 3120.8631 3141.0923 3142.7200 3165.8453 3168.8470 3524.6897
redmass: 1.0792 4.4029 5.1041 4.7778 5.4905 5.2794 3.4292 5.1796 4.8071 6.9208 4.8963 1.6257 3.2494 5.8346 3.5441 7.9155 3.9299 5.6979 4.9412 5.1143 4.9766 6.3365 3.9778 4.5035 4.0975 2.8718 3.0813 1.4779 8.3797 5.1190 3.3351 4.9925 6.9851 6.6704 8.4725 6.9602 5.8581 3.3924 5.0347 4.6879 3.9285 3.6859 1.5979 4.3162 6.0223 1.2484 4.1139 4.6742 4.4935 3.2236 5.5488 11.7112 1.3209 2.7437 1.3870 1.4389 5.6031 4.2382 4.9634 3.2140 1.6056 2.4496 2.6947 1.8409 1.8524 1.3144 1.2872 1.3621 1.3647 1.1385 1.8346 1.4148 3.0532 1.4724 1.2788 1.2664 1.2543 1.2605 1.2696 1.3430 1.2858 1.3159 1.3234 1.3334 6.0051 3.0070 1.2175 1.1413 1.0512 1.0868 1.1043 2.1832 1.0974 1.0519 6.0163 6.9213 1.0349 1.0393 1.0854 1.0628 1.0852 1.0994 1.0944 1.0894 1.1002 1.1014 1.0902 1.1009 1.0913 1.0892 1.0894 1.0959 1.0972 1.0655
irintensity: 0.9251 0.6654 0.9373 0.1807 0.1376 0.0723 0.9307 4.1784 2.7351 0.8950 1.4581 0.8729 3.4380 9.4881 3.4252 15.1381 15.1856 19.9617 2.1764 11.5125 13.6871 2.3881 7.2053 0.1887 0.8006 0.0444 12.5587 160.9581 42.5796 5.8114 32.7914 12.6878 60.4256 4.9891 141.5071 0.2512 19.0713 2.6867 5.4616 0.6118 27.6663 34.6153 95.8786 38.1350 18.2172 0.0321 49.0834 60.7060 68.5731 16.3397 90.6256 83.7252 4.0346 34.6031 0.2667 4.3920 2.2172 4.2597 253.9446 81.5251 21.0400 32.5349 34.7678 5.9979 27.4715 2.3170 7.6988 11.3963 0.5886 13.3132 2.8966 31.6232 7.0559 10.1352 7.2745 15.3328 8.6752 2.8333 6.5676 10.1246 6.1287 4.7194 4.7431 40.4655 0.3816 11.6235 18.3432 4.9300 9.6750 10.6668 17.4597 22.3049 12.7275 11.3818 17.3903 0.7679 69.1516 19.1210 35.9043 55.5038 2.1935 39.9219 18.6949 2.4924 13.6321 9.1246 21.2891 23.0431 4.6162 11.3286 5.7628 0.3749 9.1472 11.0849
temp: 298.150 k
press: 1.00000 atm
elementType: 16 8 8 8 8 8 8 8 6 6 6 6 6 6 6 6 6 6 6 6 6 6 1 1 1 1 1 1 1 1 1 1 1 1 1 1 1 1 1 1
symmnumber: 1
zpe: 801463.9 jmol-1
zpe.correction: 0.305261 hartree
zpe.thermalcorrener: 0.326826 hartree
zpe.thermalcorrenthalpy: 0.327770 hartree
zpe.thermalcorrgfe: 0.252052 hartree
zpe.sumelectzpe: -1467.013111 hartree
zpe.sumelectthermal: -1466.991547 hartree
zpe.sumelectthermalent: -1466.990602 hartree
zpe.sumelectthermalfe: -1467.066321 hartree
dipole: 3.9102 2.1836 -4.6102
dipole: 6.4274
quadrupole: -97.7838 -132.9578 -152.0393
quadrupole: -2.9248 -6.4106 -3.7276
quadrupole: 29.8098 -5.3641 -24.4457 -2.9248 -6.4106 -3.7276
hfenergy: -1467.3183727 hartree
pointgroup: C01 [X(C14H18O7S1)]
dipole: 1.5405789 -1.007947 1.7335482 debye
polarizability: 260.0970929|-4.8380838|191.5027765|23.0758925|5.4627589|154.8216382 unknown
InChI: InChI=1S/C14H18O7S/c1-8-3-5-9(6-4-8)22(16,17)21-13-12-11(15)10(7-19-12)20-14(13)18-2/h3-6,10-15H,7H2,1-2H3
charge 0 multiplicity 1
40 atoms
S  1.031671 0.116758 -1.615384
O  -3.603857 1.143003 -0.936377
O  -2.770725 -0.619326 1.649495
O  -0.130324 -0.153881 -0.153241
O  -2.665122 3.081257 1.008036
O  -3.194406 -1.996421 -0.302119
O  0.844362 1.63602 -2.147484
O  0.841783 -1.131194 -2.630258
C  -2.175716 1.170765 -0.511276
C  -2.265314 1.678902 0.937384
C  -3.380954 0.720112 1.440262
C  -1.557117 -0.249068 -0.552217
C  -4.400741 0.754298 0.27855
C  -2.200312 -1.245641 0.448888
C  -3.72175 -3.148952 0.446346
C  2.613838 -0.04475 -0.637504
C  3.198682 -1.316256 -0.530376
C  3.156078 1.11813 -0.068247
C  4.404726 -1.416757 0.195999
C  4.361657 0.985889 0.65355
C  4.996856 -0.276338 0.802669
C  6.274504 -0.406281 1.609615
H  -1.647244 1.847592 -1.200544
H  -1.333427 1.57824 1.51048
H  -3.798593 1.000938 2.416703
H  -1.650813 -0.684605 -1.565172
H  -1.42361 -1.924629 0.852403
H  -4.8604 -0.229892 0.101993
H  -5.177497 1.524353 0.4323
H  -3.270298 3.269124 0.242831
H  -4.438722 -3.639177 -0.229313
H  -4.228046 -2.822828 1.373572
H  -2.906699 -3.856043 0.70402
H  2.74069 -2.18599 -1.011687
H  2.666381 2.087973 -0.199913
H  4.890929 -2.393894 0.292836
H  4.813422 1.875221 1.1068
H  6.875158 0.518657 1.571761
H  6.044823 -0.605326 2.674324
H  6.901524 -1.239379 1.2483
