program: Gaussian 09
title: 000255904
version: EM64L-G09RevD.01
frameworkgroup: C1[X(C13H16Cl2N2)]
method: RPBEPBE
basis: SDD
operation: Freq
keyword: #p
keyword: freq=noraman
keyword: PBEPBE/SDD
title: #p freq=noraman PBEPBE/SDD
converged: YES YES NO NO
title: Mulliken charges:
elementType: Cl Cl N N C C C C C C C C C C C C C H H H H H H H H H H H H H H H H
charge: -0.074888 -0.059278 -0.076030 -0.019173 -0.367468 -0.387360 -0.386479 -0.402686 -0.379170 -0.433561 -0.375065 0.547176 -0.295408 -0.364934 -0.229361 -0.223254 -0.091676 0.206986 0.186189 0.206212 0.217376 0.216351 0.206725 0.213476 0.223995 0.241177 0.201006 0.224960 0.234778 0.231457 0.275704 0.277993 0.254233
chargesum: 0.00000
title: Mulliken charges with hydrogens summed into heavy atoms:
elementType: Cl Cl N N C C C C C C C C C C C C C
charge: -0.074888 -0.059278 -0.076030 -0.019173 0.025707 0.036228 0.036597 0.034785 0.063013 0.026178 -0.143608 0.547176 -0.295408 -0.089230 0.048632 0.030978 -0.091676
polarizability: 3.11689292e+02 -4.79825238e+00 1.74188309e+02 1.89098310e+01 2.17176734e+00 1.01903065e+02
1716.lowfreq: -11.9391 -3.7691 0.0023 0.0024 0.0028 5.1089 23.9822 31.2445 60.6318
frequency: 23.3560 30.4422 60.5900 64.0913 120.2488 143.4716 162.9044 167.8024 190.3890 232.2206 250.2332 275.3953 297.3978 326.3705 348.8021 365.3300 367.8576 397.3317 424.4642 451.2761 477.5989 510.1973 537.0987 549.5963 593.2500 645.1424 711.0958 711.9215 738.6393 754.6181 798.3304 830.7878 840.4065 853.4056 861.8204 872.8378 878.5719 902.9434 961.9243 972.9774 978.7225 1003.0891 1015.7270 1051.5726 1077.2320 1089.0110 1100.7652 1129.7556 1137.8440 1171.0953 1183.9369 1216.7042 1232.2846 1238.8300 1263.8735 1269.2491 1292.6924 1316.1229 1327.1910 1336.9581 1343.5159 1347.0435 1350.4394 1356.8463 1361.9224 1384.3829 1401.8158 1450.2343 1458.1517 1458.6609 1468.8693 1470.2821 1477.9978 1482.8400 1538.6433 1561.1432 1590.7105 2965.2389 2973.8748 2976.1992 2979.3151 2989.6685 2991.6791 3023.7808 3031.1200 3037.2874 3042.1957 3062.5387 3078.3496 3084.6079 3155.9123 3176.0379 3184.1295
redmass: 4.7493 5.1226 4.7737 5.4333 3.2069 2.6846 5.6705 8.3958 5.3840 4.3296 3.9199 3.3393 2.2925 3.4836 3.8103 6.5880 4.9743 4.7583 2.4079 3.4351 2.2493 3.6630 2.7998 3.8055 3.5350 6.8384 4.4221 3.9691 1.3968 2.7377 3.0573 1.3639 2.7067 1.7825 1.3921 2.9332 1.6961 1.8712 2.0871 1.3541 2.0518 1.9768 3.7410 2.0988 2.1820 2.2471 2.1133 1.7750 1.5470 1.6171 1.5879 1.5493 1.4977 1.2945 1.5683 1.2739 1.4006 1.3572 1.3684 1.4273 1.4058 2.5843 1.4028 1.4105 1.4339 2.5928 2.8719 1.1690 1.9792 1.1088 1.1045 1.1355 1.0868 1.1674 6.6988 6.2241 7.3234 1.0626 1.0627 1.0599 1.0623 1.0649 1.0662 1.0996 1.0953 1.1003 1.1014 1.1007 1.1005 1.0868 1.0879 1.0969 1.0935
irintensity: 0.4016 0.4039 0.3178 0.6074 0.7345 1.6598 0.1452 0.5138 0.0428 1.1758 0.0046 8.4713 0.3337 3.5832 6.1345 10.9291 1.4927 11.0028 0.4371 8.6632 8.9384 23.2766 7.5484 13.8610 7.0327 2.1180 19.8592 13.5026 17.9640 5.7839 3.9534 21.9105 23.6878 2.3718 19.3792 32.3568 46.9239 31.3298 5.8268 1.8624 0.1349 23.5320 45.8080 1.9454 62.8146 7.7734 40.3705 5.1733 26.4733 19.8653 12.3370 3.0622 30.3206 2.0531 3.3591 3.7333 13.3535 13.6023 6.9291 2.6503 15.7086 11.4726 12.2899 37.3876 1.4823 66.0171 70.6715 6.7234 53.2795 4.2339 17.0273 13.8294 14.7558 11.9906 250.3415 149.5762 6.8327 32.1815 38.2930 4.1489 34.0248 42.3847 71.0068 41.2294 54.0280 46.0744 52.4348 68.3818 18.6282 34.0914 0.4724 3.6931 0.5855
temp: 298.150 k
press: 1.00000 atm
elementType: 17 17 7 7 6 6 6 6 6 6 6 6 6 6 6 6 6 1 1 1 1 1 1 1 1 1 1 1 1 1 1 1 1
symmnumber: 1
zpe: 696174.2 jmol-1
zpe.correction: 0.265159 hartree
zpe.thermalcorrener: 0.281386 hartree
zpe.thermalcorrenthalpy: 0.282331 hartree
zpe.thermalcorrgfe: 0.219630 hartree
zpe.sumelectzpe: -1533.298031 hartree
zpe.sumelectthermal: -1533.281803 hartree
zpe.sumelectthermalent: -1533.280859 hartree
zpe.sumelectthermalfe: -1533.343560 hartree
dipole: -5.6759 -0.3763 -0.1696
dipole: 5.6909
quadrupole: -109.4994 -111.7268 -117.4070
quadrupole: 0.5677 1.1169 0.0212
quadrupole: 3.3783 1.1510 -4.5293 0.5677 1.1169 0.0212
hfenergy: -1533.5631897 hartree
pointgroup: C01 [X(C13H16Cl2N2)]
dipole: -2.2341217 -0.0489224 0.1388001 debye
polarizability: 309.6042434|24.6710725|144.3005136|-12.7029257|35.400723|133.875909 unknown
InChI: InChI=1S/C13H16Cl2N2/c14-12-6-5-11(13(15)9-12)10-16-17-7-3-1-2-4-8-17/h5-6,9-10H,1-4,7-8H2
charge 0 multiplicity 1
33 atoms
Cl 1.937725 -2.075697 -1.864207
Cl 5.765327 1.364265 0.185328
N  -2.245309 -0.419956 0.874608
N  -0.959455 0.020906 0.823219
C  -4.481408 0.937874 -0.673211
C  -3.438783 0.360801 -1.672956
C  -3.847502 1.524947 0.614813
C  -3.043136 -1.123653 -1.456442
C  -3.199451 0.47812 1.55467
C  -2.789607 -1.508146 0.033833
C  -0.051604 -0.586978 0.065672
C  1.336469 -0.122068 0.0954
C  2.349388 -0.698829 -0.719959
C  1.752731 0.946172 0.950047
C  3.689871 -0.269907 -0.711363
C  3.08058 1.40478 0.985064
C  4.036243 0.786743 0.150414
H  -5.041164 1.750344 -1.175878
H  -5.233281 0.163371 -0.413078
H  -3.824635 0.457412 -2.706421
H  -2.527049 0.989162 -1.624911
H  -3.076431 2.265255 0.323296
H  -4.616234 2.072624 1.197292
H  -3.848725 -1.784613 -1.832912
H  -2.147668 -1.341309 -2.06847
H  -2.650268 0.985738 2.365678
H  -3.987142 -0.1517 2.011978
H  -3.741548 -1.806388 0.50712
H  -2.114046 -2.384668 0.094665
H  -0.27843 -1.438157 -0.591624
H  0.98935 1.401652 1.587686
H  4.433964 -0.744026 -1.355394
H  3.372726 2.223731 1.648239
