program: Gaussian 09
title: 000250515
version: EM64L-G09RevD.01
frameworkgroup: C1[X(C11H20O3)]
method: RPBEPBE
basis: SDD
operation: Freq
keyword: #pfreq=noraman
keyword: PBEPBE/SDD
title: #p freq=noraman PBEPBE/SDD
converged: YES YES NO NO
title: Mulliken charges:
elementType: O O O C C C C C C C C C C C H H H H H H H H H H H H H H H H H H H H
charge: -0.274668 -0.252745 -0.199691 -0.049966 -0.101337 -0.425661 -0.382360 -0.409202 -0.047661 -0.342585 -0.703807 0.171724 -0.696373 -0.749208 0.235587 0.243114 0.206287 0.213819 0.193983 0.234368 0.210846 0.201188 0.229322 0.192661 0.232883 0.218551 0.218738 0.222492 0.205133 0.211821 0.223162 0.262305 0.260019 0.247261
chargesum: 0.00000
title: Mulliken charges with hydrogens summed into heavy atoms:
elementType: O O O C C C C C C C C C C C
charge: -0.274668 -0.252745 -0.199691 0.185622 0.141777 -0.005554 0.045991 0.002831 0.181661 0.082960 -0.044027 0.171724 -0.056258 0.020377
polarizability: 1.40908756e+02 -6.11766546e+00 1.29197503e+02 5.38578828e-01 -2.69791406e+00 1.05221942e+02
1716.lowfreq: -13.4577 -5.7822 -0.0012 -0.0011 -0.0008 8.4682 36.6829 49.7111 58.1629
frequency: 36.6193 49.5894 58.1134 64.6357 102.6864 109.9681 130.6050 149.1669 162.3653 191.0974 205.8741 232.3636 240.5134 256.1517 284.3677 330.9956 347.8438 406.8950 434.6961 485.7703 495.8065 546.1674 561.0169 576.0977 626.8771 739.6237 765.5836 803.9422 822.1775 866.4325 875.4090 888.8699 909.6570 921.4143 931.9785 976.2944 1000.2146 1018.4284 1020.0639 1029.6777 1037.1195 1058.6010 1068.5139 1106.5925 1127.1631 1141.9131 1176.9283 1204.1197 1226.5711 1248.3803 1251.1803 1263.0169 1280.9097 1292.3472 1302.6847 1311.3382 1327.9581 1330.1690 1344.9012 1353.1269 1355.5434 1365.1660 1367.8188 1391.5258 1391.9108 1435.3983 1445.3883 1460.4266 1467.3267 1474.6392 1476.1549 1478.6855 1479.2656 1486.0541 1487.9632 1654.7306 2953.5887 2958.8428 2970.6863 2971.8517 2974.4921 2978.2604 2981.3556 2985.8229 2991.9341 3014.2020 3022.2339 3034.1344 3045.2080 3070.8276 3072.2866 3074.3883 3076.6103 3077.6790 3078.5122 3132.6728
redmass: 4.2609 3.5041 3.3860 1.6597 2.8745 3.2707 1.1132 2.3525 2.8425 2.5800 1.8822 1.3985 1.6113 2.4682 2.8377 3.2547 3.9307 3.6564 4.4163 2.9714 3.5189 2.9126 3.0365 3.6754 3.2957 1.2418 1.3949 1.8892 3.0530 3.4808 2.9555 1.6728 1.8416 4.0352 2.1124 2.0646 2.6292 1.7141 2.0907 2.0027 2.2033 2.3343 2.4459 2.2409 2.1477 2.1891 2.5382 1.2251 1.3726 1.6791 1.6419 1.2300 1.1642 1.1117 1.3341 1.1596 1.6417 1.3160 1.3915 1.5354 1.3126 1.3125 1.4056 1.2151 1.2079 1.0490 1.0757 1.0800 1.0820 1.0513 1.0590 1.0429 1.0468 1.0725 1.0793 8.2840 1.0676 1.0818 1.0477 1.0517 1.0602 1.0365 1.0635 1.0822 1.0358 1.0944 1.0990 1.0897 1.0985 1.1009 1.1004 1.0988 1.0951 1.0992 1.0974 1.1021
irintensity: 5.2268 0.9324 1.1317 0.1154 0.4638 0.7394 0.2638 0.6975 2.0135 2.4960 0.4905 1.1384 1.7651 0.6417 3.3127 1.2408 7.6620 1.1333 9.9076 2.5064 10.2454 6.7082 4.0672 4.6760 13.9062 6.3450 8.0332 12.1635 9.6710 62.2943 70.9153 1.1399 15.8735 35.5548 5.0435 15.5167 9.4449 26.0118 32.1855 11.6915 46.5057 2.4166 19.4571 7.2667 24.7572 6.5506 7.8389 4.3021 3.0768 43.1462 20.3761 10.8242 1.3647 1.0545 1.9558 2.2938 2.8861 1.8611 2.2903 7.0930 15.5504 68.4844 12.3836 7.9150 15.8628 19.8106 38.2262 2.9818 4.5189 2.6889 7.5226 13.0379 15.1992 25.6781 0.8961 121.0903 24.9413 43.3440 12.7302 24.4232 24.9677 23.0751 61.2344 32.2215 0.8644 6.3517 22.4442 26.7279 18.4619 78.1640 61.2495 42.6135 3.6577 45.2790 42.1907 16.2455
temp: 298.150 k
press: 1.00000 atm
elementType: 8 8 8 6 6 6 6 6 6 6 6 6 6 6 1 1 1 1 1 1 1 1 1 1 1 1 1 1 1 1 1 1 1 1
symmnumber: 1
zpe: 770354.2 jmol-1
zpe.correction: 0.293412 hartree
zpe.thermalcorrener: 0.309767 hartree
zpe.thermalcorrenthalpy: 0.310711 hartree
zpe.thermalcorrgfe: 0.249001 hartree
zpe.sumelectzpe: -655.674943 hartree
zpe.sumelectthermal: -655.658588 hartree
zpe.sumelectthermalent: -655.657644 hartree
zpe.sumelectthermalfe: -655.719355 hartree
dipole: 4.6106 -1.8583 0.3154
dipole: 4.9810
quadrupole: -93.6783 -86.5252 -86.1076
quadrupole: 4.1677 -4.8162 0.0734
quadrupole: -4.9080 2.2452 2.6628 4.1677 -4.8162 0.0734
hfenergy: -655.9683555 hartree
pointgroup: C01 [X(C11H20O3)]
dipole: -1.7498511 0.8121981 0.3446014 debye
polarizability: 139.8608092|-6.6564194|127.2224576|-2.0981975|8.600363|108.2449339 unknown
InChI: InChI=1S/C11H20O3/c1-4-6-10-9(5-2)7-13-11(14-10)8(3)12/h9-11H,4-7H2,1-3H3
charge 0 multiplicity 1
34 atoms
O  0.555548 -0.70082 0.697113
O  1.326332 1.198274 -0.578355
O  3.419788 -1.479025 -0.843746
C  -1.007445 1.179025 0.300377
C  -0.897828 -0.360629 0.515062
C  -1.559989 -1.247215 -0.5630
C  -0.067697 1.625268 -0.843299
C  -2.451239 1.685663 0.059351
C  1.370721 -0.254763 -0.425126
C  -1.354052 -2.758701 -0.313104
C  -3.418899 1.393299 1.228421
C  2.828678 -0.650744 -0.108087
C  -2.051914 -3.63202 -1.376747
C  3.442707 0.006567 1.105312
H  -0.620977 1.646761 1.229094
H  -1.319717 -0.627888 1.500514
H  -1.195568 -0.987962 -1.577122
H  -2.646843 -1.028425 -0.563003
H  -0.39884 1.21881 -1.823865
H  -0.021913 2.724457 -0.913654
H  -2.85549 1.251703 -0.877005
H  -2.407645 2.781585 -0.104729
H  1.044023 -0.74078 -1.370335
H  -1.741037 -3.014966 0.694239
H  -0.270885 -2.980297 -0.290051
H  -3.568315 0.308387 1.37956
H  -3.033542 1.814113 2.175854
H  -4.411319 1.840765 1.039263
H  -3.14351 -3.449707 -1.394606
H  -1.659012 -3.417209 -2.388601
H  -1.892813 -4.707388 -1.177814
H  3.414297 1.104462 0.979035
H  2.824527 -0.223732 1.992763
H  4.47627 -0.339764 1.253794
