program: Gaussian 09
title: 000250514
version: EM64L-G09RevD.01
frameworkgroup: C1[X(C11H20O2)]
method: RPBEPBE
basis: SDD
operation: Freq
keyword: #pfreq=noraman
keyword: PBEPBE/SDD
title: #p freq=noraman PBEPBE/SDD
converged: YES YES NO NO
title: Mulliken charges:
elementType: O O C C C C C C C C C C C H H H H H H H H H H H H H H H H H H H H
charge: -0.453515 -0.442542 -0.425842 -0.031432 0.197090 -0.696359 -0.720044 -0.724688 -0.025971 0.171463 -0.050725 -0.697008 -0.695416 0.190270 0.223660 0.185507 0.230940 0.192257 0.222239 0.243413 0.207929 0.205678 0.211015 0.236639 0.225624 0.332021 0.236322 0.211184 0.223240 0.210286 0.241734 0.232068 0.332963
chargesum: 0.00000
title: Mulliken charges with hydrogens summed into heavy atoms:
elementType: O O C C C C C C C C C C C
charge: -0.121494 -0.109579 -0.011912 0.154075 0.197090 -0.050923 -0.063024 -0.051411 -0.025971 0.171463 -0.050725 -0.026262 -0.011328
polarizability: 1.52198480e+02 -5.34451249e+00 1.22153885e+02 9.50762613e-01 2.57971863e-01 1.09024773e+02
1716.lowfreq: -18.2898 -15.9948 -4.5794 -0.0008 -0.0005 -0.0004 5.3596 36.1528 58.9500
frequency: -15.9543 36.0466 58.9385 75.3906 118.7235 134.0914 173.0669 186.7887 199.0932 205.7749 228.2080 249.6819 253.7082 255.4470 285.1641 290.2970 302.1115 327.0739 345.4848 370.6375 378.1523 394.9963 430.9117 467.5360 510.8002 529.9270 557.9337 590.7952 626.7146 748.3891 785.3784 810.8182 865.5774 890.8743 911.0298 919.7627 926.5758 960.0509 969.9070 994.7963 999.4466 1029.0524 1079.3826 1090.9845 1098.4667 1140.8380 1149.9817 1168.8350 1199.6436 1231.0429 1267.3245 1301.7201 1312.4088 1327.8981 1337.7239 1360.1242 1371.4374 1376.2571 1381.0100 1389.9541 1396.4708 1443.2519 1451.3742 1457.3634 1460.1908 1462.8046 1466.8754 1469.7274 1474.1227 1478.9721 1480.7845 1489.7626 2246.8067 2947.1004 2973.8909 2979.0358 2983.1020 2984.9399 2987.3513 3001.2670 3041.0203 3059.8567 3071.3897 3083.7956 3084.3869 3089.4908 3093.5671 3096.0474 3097.1165 3105.5935 3113.9587 3540.0825 3544.2404
redmass: 3.2556 2.8867 3.2894 4.1496 2.4677 3.4027 3.3374 1.3121 1.0768 1.8864 1.6213 1.1092 1.1495 1.4969 1.1984 2.6482 1.1418 2.6863 2.3945 2.8191 2.4329 2.3439 2.5645 3.3332 5.5023 4.3838 5.4219 4.1339 3.0941 4.7978 3.4002 3.0650 2.4456 1.7655 1.9571 1.2627 1.5156 1.5086 2.0184 1.6475 1.3934 2.0164 1.6339 1.6773 1.6379 2.1762 2.2220 2.3211 1.9630 2.6784 1.1992 1.7622 1.7573 1.6208 1.5053 1.3396 1.2120 1.2106 1.2018 1.2096 1.2118 1.0770 1.0506 1.0485 1.0443 1.0555 1.0568 1.0629 1.0544 1.0496 1.0517 1.0561 11.9561 1.0810 1.0372 1.0398 1.0371 1.0348 1.0554 1.0346 1.1018 1.0990 1.0985 1.0998 1.0999 1.0982 1.0983 1.1007 1.1010 1.1003 1.1009 1.0659 1.0660
irintensity: 0.9203 0.0754 0.0410 2.6895 1.1405 0.4636 0.1761 1.4098 1.8559 1.7391 5.5504 0.6034 12.6380 0.2263 109.1406 12.7145 137.2173 7.6832 23.6280 8.6653 0.4647 4.7046 9.5611 5.7503 26.6911 8.0661 4.4290 1.3322 13.7979 6.8331 15.9953 8.9628 39.6596 22.4544 11.0147 1.1142 0.9772 0.4318 3.0328 20.0472 1.2912 27.1637 26.6071 9.7372 68.6268 37.9497 36.0792 3.8376 7.6914 81.7043 4.1631 43.3765 42.4517 76.0391 26.6062 2.2571 17.8854 24.7868 7.5980 10.0775 16.0200 3.6891 5.2026 2.6420 2.0196 13.1572 1.8575 6.6965 1.8101 21.1073 8.3851 5.5618 0.6149 29.7307 36.7998 45.9363 21.1420 19.2911 32.1382 13.2360 14.5261 38.1936 47.0004 20.6016 40.1227 22.3322 52.0239 34.1519 8.6899 43.1044 20.4694 6.1153 6.0241
temp: 298.150 k
press: 1.00000 atm
elementType: 8 8 6 6 6 6 6 6 6 6 6 6 6 1 1 1 1 1 1 1 1 1 1 1 1 1 1 1 1 1 1 1 1
symmnumber: 1
zpe: 745488.4 jmol-1
zpe.correction: 0.283942 hartree
zpe.thermalcorrener: 0.300393 hartree
zpe.thermalcorrenthalpy: 0.301337 hartree
zpe.thermalcorrgfe: 0.241397 hartree
zpe.sumelectzpe: -580.484514 hartree
zpe.sumelectthermal: -580.468062 hartree
zpe.sumelectthermalent: -580.467118 hartree
zpe.sumelectthermalfe: -580.527058 hartree
dipole: 0.2742 0.9110 0.6071
dipole: 1.1286
quadrupole: -86.8841 -74.8822 -82.8326
quadrupole: 0.7403 9.9030 1.4745
quadrupole: -5.3511 6.6507 -1.2996 0.7403 9.9030 1.4745
hfenergy: -580.7684551 hartree
pointgroup: C01 [X(C11H20O2)]
dipole: 0.085809 -0.321381 -0.2940968 debye
polarizability: 151.8023306|5.759132|121.901063|-3.7425057|1.56905|109.6737446 unknown
InChI: InChI=1S/C11H20O2/c1-9(2)8-11(5,13)7-6-10(3,4)12/h9,12-13H,8H2,1-5H3
charge 0 multiplicity 1
33 atoms
O  -1.977298 -1.254511 -1.372267
O  3.49122 -0.911397 0.287772
C  -2.413556 -0.217239 0.76698
C  -2.410611 1.324503 0.539374
C  -1.405277 -1.128191 0.006361
C  -2.334936 1.743378 -0.948141
C  -1.334715 2.052768 1.384614
C  -1.386653 -2.538369 0.6591
C  -0.015844 -0.619597 -0.075198
C  2.587566 0.140945 -0.266732
C  1.173398 -0.295386 -0.165982
C  2.964452 0.416447 -1.744814
C  2.855615 1.369467 0.626583
H  -2.284716 -0.406714 1.850747
H  -3.405979 -0.619777 0.483162
H  -3.396401 1.665474 0.924176
H  -3.101253 1.2269 -1.551167
H  -2.482862 2.836288 -1.042702
H  -1.351988 1.490232 -1.382969
H  -0.316243 1.763398 1.075064
H  -1.429441 3.148995 1.267818
H  -1.443519 1.816568 2.460564
H  -0.76896 -3.237234 0.066134
H  -2.41862 -2.928507 0.700947
H  -0.974086 -2.497849 1.682426
H  -1.315263 -1.731719 -1.937221
H  4.030848 0.696265 -1.796571
H  2.802798 -0.481086 -2.369384
H  2.355875 1.237952 -2.162204
H  2.253221 2.232113 0.29464
H  2.606537 1.137298 1.674677
H  3.926554 1.629927 0.568928
H  3.294136 -1.765548 -0.177616
