program: Gaussian 09
title: 000250510
version: EM64L-G09RevD.01
frameworkgroup: C1[X(C11H14O)]
method: RPBEPBE
basis: SDD
operation: Freq
keyword: #pfreq=noraman
keyword: PBEPBE/SDD
title: #p freq=noraman PBEPBE/SDD
converged: YES YES NO NO
title: Mulliken charges:
elementType: O C C C C C C C C C C C H H H H H H H H H H H H H H
charge: -0.297495 -0.340474 0.389450 -0.382465 -0.390503 -0.404106 0.520382 -0.226257 -0.217282 -0.242105 -0.794560 -0.728039 0.203059 0.202154 0.210961 0.185374 0.225262 0.273697 0.224039 0.224229 0.226320 0.214188 0.256496 0.221305 0.222442 0.223929
chargesum: 0.00000
title: Mulliken charges with hydrogens summed into heavy atoms:
elementType: O C C C C C C C C C C C
charge: -0.297495 0.064739 0.389450 0.013869 -0.165241 -0.130409 0.520382 -0.002218 0.006947 -0.015784 -0.102571 -0.281668
polarizability: 1.62603139e+02 -5.09286564e-02 1.13218515e+02 -1.60097960e+01 -6.10308344e+00 8.04694069e+01
1716.lowfreq: -8.2507 -3.1303 -0.0005 -0.0003 0.0007 12.6171 20.0869 35.6928 67.9541
frequency: 19.1415 35.6452 67.9174 76.0748 106.4023 165.2155 190.2899 220.4438 262.6824 355.7523 402.2953 407.7223 423.8596 463.3712 541.1762 591.0766 616.3530 700.3327 702.8050 739.1976 798.1493 843.9973 856.8283 909.7763 928.7637 950.9555 964.7444 978.4140 979.3889 989.3542 995.1982 1014.5762 1025.5584 1036.7883 1043.4402 1065.2870 1085.2014 1170.7840 1182.9419 1192.1300 1202.9763 1216.4991 1300.5738 1303.3619 1331.9026 1376.9154 1389.5336 1396.5558 1432.5398 1439.9854 1451.5095 1462.0703 1476.2276 1478.5373 1485.2473 1595.0248 1618.2859 1677.0445 2893.1905 2901.4872 2938.5616 2971.4405 2972.8862 3055.5152 3090.1614 3094.7533 3109.7173 3124.9888 3139.2147 3157.4884 3173.9456 3193.9685
redmass: 3.1130 3.4429 3.7269 3.1317 2.7647 1.1168 3.2962 3.3065 4.8283 2.9842 2.8262 2.5921 2.3236 2.8007 3.2811 4.3676 6.4127 1.2779 1.9045 1.3706 3.9949 3.1514 1.2512 1.3226 4.3766 1.3192 1.5003 1.6314 1.3767 6.1545 1.3543 1.6501 2.2834 1.5566 4.3044 1.7577 1.7062 1.0551 1.1110 1.0709 1.1397 2.2909 1.3638 2.5564 1.3144 2.8698 1.3158 2.1147 1.2050 2.0433 1.0547 1.0949 1.0972 1.0775 2.2230 6.1970 6.0780 5.1468 1.0584 1.0584 1.1025 1.0923 1.0446 1.0935 1.0635 1.1002 1.0874 1.0867 1.0930 1.0983 1.0964 1.1139
irintensity: 0.6503 0.2987 0.2791 3.2781 8.6082 0.8375 4.1549 2.0921 0.0994 0.5606 0.1659 6.7653 0.6993 7.5978 3.2720 1.6437 0.1032 4.2269 25.0785 84.6338 1.5455 0.0612 0.1678 1.7647 24.2408 87.2027 0.4244 0.7480 0.2223 0.0899 0.6693 3.6019 38.3370 25.5257 142.3704 14.7633 23.2674 0.3774 2.3465 2.1046 5.5494 2.0758 29.6460 3.8367 20.1737 2.5790 25.2310 4.9775 5.4049 9.6551 13.9096 11.0615 14.9547 23.0829 13.2585 1.5342 7.9251 17.4496 18.2501 102.1298 51.2389 26.4795 48.2075 20.3001 11.0071 23.1205 11.1650 1.3199 34.3454 32.7344 7.1553 24.0263
temp: 298.150 k
press: 1.00000 atm
elementType: 8 6 6 6 6 6 6 6 6 6 6 6 1 1 1 1 1 1 1 1 1 1 1 1 1 1
symmnumber: 1
zpe: 571528.7 jmol-1
zpe.correction: 0.217684 hartree
zpe.thermalcorrener: 0.230043 hartree
zpe.thermalcorrenthalpy: 0.230987 hartree
zpe.thermalcorrgfe: 0.176895 hartree
zpe.sumelectzpe: -501.855036 hartree
zpe.sumelectthermal: -501.842677 hartree
zpe.sumelectthermalent: -501.841733 hartree
zpe.sumelectthermalfe: -501.895825 hartree
dipole: 0.3894 -1.5024 0.2897
dipole: 1.5789
quadrupole: -66.6519 -65.6109 -74.6478
quadrupole: -0.4033 -0.5543 -0.6749
quadrupole: 2.3183 3.3593 -5.6776 -0.4033 -0.5543 -0.6749
hfenergy: -502.0727196 hartree
pointgroup: C01 [X(C11H14O1)]
dipole: -0.1893332 -0.178438 0.5640692 debye
dipolederiv: -1.3469357 0.1095341 -0.0844116 -0.0009317 -0.3906916 0.004185 -0.1435198 0.020965 -0.3989648 0.7071015 -0.026437 0.1280329 -0.0173101 0.4353904 -0.0240778 0.4801593 -0.030058 0.3413555 0.1923282 -0.0189134 -0.1131469 -0.0348903 -0.0429132 0.0160454 -0.2464423 0.0138214 0.0240436 0.9855692 -0.0917357 -0.0518777 0.0300386 0.378552 -0.0123472 -0.2413226 -0.0583132 0.2559057 -0.1731931 -0.0070482 0.0162811 -0.0223559 -0.1396419 -0.0931829 0.0263702 -0.095195 0.0588512 -0.0594269 -0.040248 0.062991 -0.0309112 -0.1180262 -0.0353748 0.1453214 -0.0501417 -0.0965291 0.0313798 -0.1072039 0.0724599 -0.1502991 0.2295146 0.1329039 0.093999 0.1756292 0.125718 0.0417961 -0.0576463 0.0435097 -0.056715 -0.1088706 -0.0698959 0.0632798 -0.0723367 -0.0118406 -0.0260848 -0.0114717 -0.0296471 -0.0154764 -0.1119295 -0.0986182 -0.043197 -0.0975095 0.1078933 0.0295566 -0.0115958 -0.0662188 -0.0060554 -0.1612862 -0.0324562 -0.0775622 -0.0298261 -0.0662155 -0.0033179 0.0570148 0.0320541 0.0678136 -0.0716034 -0.1168525 -0.0346403 -0.1058873 -0.0624021 -0.2965138 -0.0030984 0.1793048 -0.0660948 -0.2495833 0.1232814 0.1458208 0.1382893 -0.1256515 -0.0728823 -0.0338171 0.0243936 -0.0148794 -0.1215961 0.1332708 -0.052354 0.1029669 -0.032696 -0.1034471 0.0343163 0.0464082 0.0298302 -0.0604857 -0.1503405 -0.0723025 -0.0931246 -0.0984939 -0.0586481 0.0029517 -0.0084858 0.0353185 -0.0998188 -0.1516457 0.0622187 -0.1130615 -0.0551063 -0.0969789 0.0397129 -0.0235344 -0.0475572 -0.131146 0.1547923 0.0736527 0.1068287 -0.0359465 0.0916666 -0.0114963 0.0508344 -0.0056596 0.110523 0.0953802 0.0299096 0.0939825 -0.0902262 0.0698883 0.0497174 -0.0709861 0.0759015 0.1229249 0.0369721 -0.0987954 0.0496403 0.0726488 -0.0706568 0.0741501 -0.0793271 0.0789142 0.1162333 0.063827 -0.0855922 0.0652466 0.040945 0.0708587 0.0037336 0.0256271 -0.005566 0.1154044 0.0966156 0.0461798 0.0943516 -0.0954723 -0.1073117 0.0119453 0.0919543 0.0123858 0.1502208 0.0256544 0.0957783 0.0259266 0.0563502 0.1255446 -0.0255659 -0.0086438 0.0022282 -0.1345248 0.0554775 0.0405219 0.1025883 0.0265562 -0.0193196 0.0017435 0.1066825 0.0186101 0.0847747 0.0053349 0.1256729 -0.0438845 0.0678988 -0.0544362 -0.0005089 -0.1576031 0.0454099 0.0776423 0.0205414 -0.1245437 -0.0231733 -0.0302607 0.1314954 0.0190131 -0.0559698 0.0372157 0.0086478 -0.1324257 -0.0361866 -0.1529862 0.0110756 0.0119678 0.0429536 -0.1306816 0.0410359 0.1122892 -0.0470647 -0.1724258 -0.0247389 0.0105635 unknown
polarizability: 159.9158796|-21.2918636|85.4604154|-0.9998061|-10.8010055|110.9147668 unknown
InChI: InChI=1S/C11H14O/c1-10(2)8-12-9-11-6-4-3-5-7-11/h3-7H,1,8-9H2,2H3
charge 0 multiplicity 1
26 atoms
O  -1.150795 0.076809 0.240251
C  -0.104808 -0.152733 1.236563
C  1.252795 -0.163535 0.554743
C  -2.486984 0.171204 0.854957
C  2.380647 -0.66502 1.252439
C  1.419734 0.342372 -0.756625
C  -3.525906 0.23797 -0.2474
C  3.659062 -0.654032 0.652405
C  2.699135 0.348972 -1.35887
C  3.822675 -0.145735 -0.657829
C  -3.464282 -0.867892 -1.280853
C  -4.459376 1.22495 -0.260933
H  -0.281077 -1.119556 1.76128
H  -0.138105 0.652976 2.007288
H  -2.543575 1.066367 1.511043
H  -2.657889 -0.734369 1.484739
H  2.261065 -1.068209 2.266683
H  0.54234 0.717025 -1.291173
H  4.523072 -1.044793 1.201896
H  2.817849 0.740355 -2.375853
H  4.813304 -0.139183 -1.126429
H  -3.572379 -1.862129 -0.803526
H  -2.478626 -0.864225 -1.780049
H  -4.254419 -0.758276 -2.042734
H  -4.466174 2.024137 0.490049
H  -5.243185 1.260752 -1.026066
