program: Gaussian 09
title: 000250507
version: EM64L-G09RevD.01
frameworkgroup: C1[X(C10H14O)]
method: RPBEPBE
basis: SDD
operation: Freq
keyword: #pfreq=noraman
keyword: PBEPBE/SDD
title: #p freq=noraman PBEPBE/SDD
converged: YES YES NO NO
title: Mulliken charges:
elementType: O C C C C C C C C C C H H H H H H H H H H H H H H
charge: -0.450013 -0.565848 0.340546 -0.061272 0.286655 -0.386137 -0.708653 -0.408287 -0.847483 -0.252057 -0.237633 0.237053 0.230786 0.204627 0.233262 0.221484 0.239732 0.204766 0.227479 0.242158 0.235139 0.227552 0.224903 0.225310 0.335932
chargesum: 0.00000
title: Mulliken charges with hydrogens summed into heavy atoms:
elementType: O C C C C C C C C C C
charge: -0.114081 -0.098009 0.340546 0.143356 0.286655 -0.152875 -0.042671 -0.180809 -0.142634 -0.027154 -0.012323
polarizability: 1.33987686e+02 2.53192701e+00 1.14291786e+02 -1.05138163e+01 -1.07387162e+00 7.32063050e+01
1716.lowfreq: -14.7301 -5.0083 -0.0009 -0.0004 0.0004 9.5441 55.4788 75.1766 91.7555
frequency: 55.3939 75.0563 91.7235 149.3328 183.5869 251.8614 258.9739 272.6115 287.4328 341.3699 381.0820 407.3742 436.3265 456.4081 515.8249 541.7879 607.5338 721.0473 747.6425 767.6685 824.8528 831.7548 875.5675 894.2414 911.5767 948.6403 986.3280 987.0407 1031.2907 1042.9552 1058.7338 1065.1817 1069.0740 1123.6125 1173.9356 1187.6624 1202.6048 1233.3452 1246.1953 1290.4210 1297.9236 1330.2280 1371.9108 1378.7300 1382.0695 1398.6692 1431.8521 1466.2669 1467.4355 1470.1695 1478.1803 1484.8156 1492.0247 1588.2495 1613.6685 2941.6857 2972.9179 2976.7905 3006.4556 3053.9897 3063.1142 3071.6708 3082.9417 3086.4920 3110.8784 3117.4896 3135.8922 3158.1752 3556.4594
redmass: 3.3382 3.5094 3.9269 1.0906 2.6010 1.4869 1.8295 1.2091 2.6655 2.9318 2.2929 2.7984 2.3728 2.7745 3.8805 3.9426 5.5610 3.5515 1.5956 2.3628 2.6595 3.4823 1.3483 1.4898 2.2781 1.3997 1.3352 1.5823 1.8691 1.5705 1.7059 2.1613 1.7358 1.7513 1.0647 1.9739 1.4682 2.2536 1.3869 1.4046 1.3339 1.3380 2.2612 2.5204 1.2856 1.2541 2.0531 1.0833 1.0659 1.0929 1.0954 1.7194 1.3340 6.5236 6.1616 1.0842 1.0363 1.0375 1.0616 1.0967 1.0985 1.1000 1.0987 1.0997 1.0866 1.0884 1.0930 1.1007 1.0660
irintensity: 1.8871 0.0627 0.7785 0.6519 0.3541 6.6412 10.8783 101.6040 34.6485 7.4876 1.5916 1.4945 1.3922 10.3918 7.5915 1.3070 6.9984 0.4436 49.5694 30.1700 6.1985 6.3091 0.3512 5.5838 28.8437 1.2929 0.1147 2.1101 4.8257 10.7106 6.3694 75.1323 38.3515 16.5281 0.0765 0.1127 11.1468 1.1709 7.6929 1.0717 5.4900 16.9917 5.9587 3.9022 29.6298 13.2265 1.9815 3.0514 6.7875 14.0882 18.2589 23.8332 9.5213 1.0942 2.2338 46.6220 22.1190 29.1592 19.3387 22.6275 36.5604 25.1576 12.9115 37.9833 14.4358 4.6586 34.3893 30.8837 2.6131
temp: 298.150 k
press: 1.00000 atm
elementType: 8 6 6 6 6 6 6 6 6 6 6 1 1 1 1 1 1 1 1 1 1 1 1 1 1
symmnumber: 1
zpe: 559387.0 jmol-1
zpe.correction: 0.213059 hartree
zpe.thermalcorrener: 0.224511 hartree
zpe.thermalcorrenthalpy: 0.225455 hartree
zpe.thermalcorrgfe: 0.175933 hartree
zpe.sumelectzpe: -463.846362 hartree
zpe.sumelectthermal: -463.834910 hartree
zpe.sumelectthermalent: -463.833966 hartree
zpe.sumelectthermalfe: -463.883488 hartree
dipole: 0.0732 0.2566 1.7859
dipole: 1.8058
quadrupole: -63.6522 -61.7926 -70.1930
quadrupole: -1.1041 5.0454 -1.3612
quadrupole: 1.5604 3.4200 -4.9804 -1.1041 5.0454 -1.3612
hfenergy: -464.0594213 hartree
pointgroup: C01 [X(C10H14O1)]
dipole: 0.1346614 -0.1588097 -0.6792419 debye
dipolederiv: -0.81111 -0.0833008 -0.2989358 -0.0657728 -0.5917329 -0.1344852 -0.2787774 -0.1353319 -0.3308523 -0.1477911 -0.0505357 0.0004113 -0.1117238 0.0746506 -0.0251277 0.1033605 -0.0034305 0.0389102 0.2898846 0.0388512 0.0880373 0.0866153 -0.1222811 0.0591078 0.1834377 0.0377425 -0.0401082 0.8001496 0.0787868 0.1579413 0.1115451 0.4375941 0.0932045 0.0327041 0.0757857 0.3556217 -0.0507483 -0.1488735 0.030823 -0.1631558 0.2206797 -0.0980065 0.0136154 -0.104082 -0.0134172 -0.0996542 0.0313344 0.0512431 0.0858112 0.0552084 0.0247768 0.0193656 0.0056934 -0.1437162 -0.0629819 0.0196977 0.0129146 -0.0057322 -0.0571811 -0.1453624 -0.028602 -0.1462013 -0.092058 -0.0599151 0.1312807 0.0421895 0.0703467 0.0122531 0.0255713 0.0507477 0.0510747 -0.1515483 0.0107106 0.1259457 -0.0307669 0.0732239 -0.0601256 0.0537989 -0.0312621 0.0787522 0.0438526 -0.0599661 -0.0458559 0.0549667 -0.0695239 0.0496935 -0.034435 0.0572429 -0.0304398 -0.1379921 0.032159 0.0079733 0.1043064 0.0317679 -0.0403675 0.0052986 0.0891341 -0.003194 -0.1117423 0.0383202 0.0203546 0.0025195 -0.0024672 -0.0234676 -0.1210712 -0.0089913 -0.0801927 -0.0297709 0.0313677 0.0404342 -0.0277958 0.0628624 -0.0580135 0.1066929 -0.0156286 0.0628202 0.0355586 -0.0484078 0.0484833 -0.0543605 0.0749844 -0.1469489 0.0842753 -0.0605986 0.0561536 -0.0591503 0.0496851 -0.103956 -0.0462645 -0.0903722 -0.0698087 -0.0253788 -0.042899 -0.035591 0.1163869 0.092271 0.0522925 -0.0133984 0.066824 -0.0828836 0.0553853 -0.0399394 0.1078526 0.0201875 -0.035992 -0.0503326 -0.1200849 -0.0436781 0.055842 -0.0395344 -0.1408927 -0.0304806 0.0394935 -0.087867 -0.0379916 0.1464588 -0.0859254 0.0453846 0.0554822 0.1469795 0.0283404 -0.0245736 0.0506875 -0.0684682 -0.0375875 -0.1034182 -0.1007018 -0.0286717 -0.0429493 -0.0162747 0.1322544 -0.0969214 0.0827651 0.0728794 0.0569386 0.0551439 0.0146742 0.0868475 -0.0164338 0.0473187 0.0878987 0.0316764 -0.0544833 0.0325821 0.0420539 -0.0092853 -0.054672 0.0561007 -0.1235456 -0.0064412 -0.1674838 -0.0318567 -0.0648321 -0.0632808 -0.0173846 -0.0490642 -0.0710043 0.0875904 0.0397866 0.0823091 -0.0555824 0.0969928 -0.0770123 0.0528512 -0.0629754 0.0486628 0.1295169 -0.0929801 -0.0014004 -0.1162181 -0.0092863 0.0834464 -0.0003475 -0.1203195 0.0042568 0.104036 0.1378557 -0.0339866 0.1226439 -0.0346063 0.361855 0.0479712 0.1941365 0.059421 0.1077474 unknown
polarizability: 130.3086823|1.2275365|113.6816358|18.3910824|-3.3009932|77.4954586 unknown
InChI: InChI=1S/C10H14O/c1-8-5-3-4-6-10(8)7-9(2)11/h3-6,9,11H,7H2,1-2H3
charge 0 multiplicity 1
25 atoms
O  3.555473 0.87521 0.87361
C  1.254148 0.237652 1.069174
C  -0.130314 0.125231 0.44265
C  2.354035 0.614473 0.047565
C  -0.770538 -1.131609 0.213424
C  -0.800862 1.317255 0.061925
C  2.631175 -0.472427 -1.004847
C  -2.051794 -1.144856 -0.397581
C  -0.127436 -2.448644 0.622075
C  -2.074314 1.290797 -0.545718
C  -2.703933 0.047998 -0.780365
H  1.258146 1.030299 1.841055
H  1.560801 -0.697755 1.56863
H  2.052174 1.55311 -0.467768
H  -0.316163 2.282101 0.259996
H  2.993847 -1.394742 -0.515405
H  1.715152 -0.70718 -1.57623
H  3.400886 -0.13906 -1.727744
H  -2.545426 -2.109084 -0.571298
H  0.851776 -2.60161 0.132342
H  0.048196 -2.496192 1.71367
H  -0.775015 -3.300191 0.35155
H  -2.571482 2.226075 -0.826498
H  -3.693827 0.006887 -1.248758
H  4.324796 1.047365 0.272948
