program: Gaussian 09
title: 000255921
version: EM64L-G09RevD.01
frameworkgroup: C1[X(C14H11ClN2O4)]
method: RPBEPBE
basis: SDD
operation: Freq
keyword: #p
keyword: freq=noraman
keyword: PBEPBE/SDD
title: #p freq=noraman PBEPBE/SDD
converged: YES YES NO NO
title: Mulliken charges:
elementType: Cl O O O O N N C C C C C C C C C C C C C C H H H H H H H H H H H
charge: -0.056327 -0.351503 -0.346982 -0.214443 -0.162779 -0.475893 0.013336 0.450667 0.366432 0.156688 0.240627 0.075763 -0.315735 -0.391468 0.265986 -0.339645 -0.813024 -0.243048 -0.223076 -0.330666 -0.252699 0.319476 0.241343 0.214499 0.225680 0.227992 0.288339 0.261897 0.239372 0.287257 0.244528 0.397404
chargesum: 0.00000
title: Mulliken charges with hydrogens summed into heavy atoms:
elementType: Cl O O O O N N C C C C C C C C C C C C C C
charge: -0.056327 0.045901 -0.346982 -0.214443 -0.162779 -0.156417 0.013336 0.450667 0.366432 0.156688 0.240627 0.075763 -0.315735 -0.150124 0.265986 -0.125146 -0.071013 0.018850 0.016296 -0.043409 -0.008171
polarizability: 3.12373452e+02 1.73316266e+01 1.96451920e+02 3.13187986e+00 9.41180039e+00 1.11459498e+02
1716.lowfreq: -2.9475 0.0014 0.0019 0.0027 2.6428 9.1299 22.8496 31.8556 44.4022
frequency: 22.7921 31.6427 44.3838 49.8641 74.7872 103.1921 128.5026 157.2108 175.1817 186.4845 193.0212 224.8812 238.5305 252.5696 295.6765 316.7107 347.8343 371.6978 382.8032 395.2121 436.0048 456.3888 474.1729 512.0228 516.1776 523.3724 533.9727 579.4376 584.5517 603.8869 635.3932 658.6382 691.2773 709.8243 722.5170 743.7807 771.7309 776.1433 804.0781 815.8338 833.8627 865.8727 897.2309 909.7968 927.1850 970.5245 974.9390 979.0156 995.0333 1049.3438 1079.6953 1091.5946 1105.1099 1143.7913 1164.9474 1184.5764 1191.6068 1212.9545 1234.0409 1270.5383 1277.2760 1299.6895 1337.7779 1366.6232 1371.7297 1400.8551 1405.1975 1421.2309 1427.0502 1457.0846 1464.2348 1468.2760 1481.1127 1510.1498 1563.5404 1575.1046 1589.9225 1611.0839 1640.7376 2640.3193 2986.2699 3069.3702 3093.9624 3130.9355 3139.1937 3159.8986 3167.1079 3181.5446 3185.5866 3507.8035
redmass: 8.5761 8.3427 9.6280 5.9035 8.9622 6.4005 8.1125 3.9380 6.2869 1.5814 3.4299 2.7528 7.1094 5.7699 4.9329 3.2880 8.2440 9.9687 7.7386 6.4763 8.8197 5.4291 4.0685 4.0509 4.3282 2.8477 3.8309 7.0128 4.9922 1.9106 5.6463 7.3674 7.1470 5.5077 5.7734 2.1047 7.7081 1.2745 2.5339 5.3738 6.1054 5.2649 1.3918 5.5872 1.4143 1.0639 1.3359 1.3663 1.6336 1.5411 2.1693 1.9031 4.2394 2.3533 1.9860 1.3598 1.3750 6.0775 2.3713 2.2538 3.2044 2.5700 2.3088 8.8033 8.5509 1.3559 2.9366 2.2836 3.0115 1.3274 2.0011 3.1197 1.1194 2.1366 4.9292 5.8577 3.6930 6.5921 3.8915 1.0736 1.0365 1.0970 1.1000 1.0890 1.0879 1.0932 1.0906 1.0982 1.0981 1.0752
irintensity: 1.3921 0.4788 3.1636 0.1368 0.3817 1.0584 0.6510 0.6362 0.7925 1.8938 1.9669 1.6583 3.8349 3.2403 8.4828 0.8206 2.3477 18.6472 6.1257 8.5942 5.4650 5.6313 6.8415 3.0064 13.8661 2.5843 14.9250 9.2655 0.3460 49.0024 36.8267 27.0044 36.2337 7.8553 4.4646 62.7197 5.2739 61.4859 6.3690 27.1839 18.5287 21.6255 1.5742 33.6391 2.6899 129.1835 0.1532 2.0413 10.9870 8.1366 5.0649 17.3021 14.1248 9.4331 88.8105 6.8898 59.6116 267.8062 2.9189 7.1390 32.5985 111.9238 238.2603 68.0186 42.4036 44.7153 81.1864 10.3935 70.5816 82.0897 91.0104 83.2335 21.7300 467.6531 88.4809 64.9009 38.9657 3.0189 94.0592 774.7494 16.5928 6.7717 21.9932 12.6334 5.2660 13.4333 5.2831 6.7858 4.8347 36.4650
temp: 298.150 k
press: 1.00000 atm
elementType: 17 8 8 8 8 7 7 6 6 6 6 6 6 6 6 6 6 6 6 6 6 1 1 1 1 1 1 1 1 1 1 1
symmnumber: 1
zpe: 595468.2 jmol-1
zpe.correction: 0.226802 hartree
zpe.thermalcorrener: 0.245265 hartree
zpe.thermalcorrenthalpy: 0.246209 hartree
zpe.thermalcorrgfe: 0.178279 hartree
zpe.sumelectzpe: -1408.999316 hartree
zpe.sumelectthermal: -1408.980853 hartree
zpe.sumelectthermalent: -1408.979909 hartree
zpe.sumelectthermalfe: -1409.047839 hartree
dipole: -7.5560 2.7580 4.3012
dipole: 9.1214
quadrupole: -145.1428 -125.2263 -127.9592
quadrupole: 17.2067 11.5389 0.2949
quadrupole: -12.3667 7.5498 4.8169 17.2067 11.5389 0.2949
hfenergy: -1409.2261177 hartree
pointgroup: C01 [X(C14H11Cl1N2O4)]
dipole: 2.885093 1.4338309 1.580738 debye
polarizability: 314.1986881|-11.764412|111.1071709|-3.8950668|0.9280368|194.9790113 unknown
InChI: InChI=1S/C14H11ClN2O4/c1-8-4-2-6-10(15)12(8)16-14(19)9-5-3-7-11(13(9)18)17(20)21/h2-7,16,18H,1H3
charge 0 multiplicity 1
32 atoms
Cl 2.687549 -1.051603 2.87039
O  -1.971956 -0.634344 -1.709271
O  0.486294 -0.41548 -1.34035
O  -5.778902 -0.308797 -0.193497
O  -4.620274 -0.139422 -2.152529
N  1.368061 0.454214 0.632583
N  -4.697491 -0.074202 -0.871419
C  2.743932 0.180962 0.349548
C  3.393119 0.651347 -0.832662
C  -1.072217 0.505425 0.264214
C  0.30165 0.160572 -0.19702
C  -2.177612 0.058046 -0.557954
C  3.509418 -0.516682 1.320631
C  4.76518 0.338351 -1.0076
C  -3.503315 0.333974 -0.096783
C  -1.334546 1.232266 1.452986
C  2.670593 1.495521 -1.859405
C  4.870468 -0.807446 1.15132
C  5.497095 -0.38394 -0.042461
C  -3.734309 1.01587 1.113137
C  -2.650435 1.483988 1.883854
H  1.154337 0.637008 1.617002
H  5.267354 0.688508 -1.915902
H  -0.508311 1.632564 2.051896
H  1.998265 2.22989 -1.379555
H  3.391439 2.044158 -2.488135
H  2.039725 0.863217 -2.509586
H  5.419684 -1.353898 1.922391
H  6.556416 -0.606498 -0.204772
H  -4.769981 1.17697 1.425008
H  -2.833059 2.04434 2.804521
H  -0.936671 -0.70308 -1.842883
