program: Gaussian 09
title: 000255894
version: EM64L-G09RevD.01
frameworkgroup: C1[X(C8H9Cl2N3O3)]
method: RPBEPBE
basis: SDD
operation: Freq
keyword: #p
keyword: freq=noraman
keyword: PBEPBE/SDD
title: #p freq=noraman PBEPBE/SDD
converged: YES YES NO NO
title: Mulliken charges:
elementType: Cl Cl O O O N N N C C C C C C C C H H H H H H H H H
charge: 0.040295 0.010866 -0.286530 -0.253340 -0.285894 -0.214816 -0.217996 -0.657818 -0.067659 0.375343 0.239432 0.208815 -0.660777 0.362832 -0.599286 -0.722811 0.245399 0.302668 0.245432 0.280686 0.251716 0.252924 0.408422 0.344763 0.397334
chargesum: 0.00000
title: Mulliken charges with hydrogens summed into heavy atoms:
elementType: Cl Cl O O O N N N C C C C C C C C
charge: 0.040295 0.010866 -0.286530 -0.253340 -0.285894 -0.214816 -0.217996 0.095366 -0.067659 0.375343 0.239432 0.208815 0.132722 0.362832 0.186040 -0.325477
polarizability: 1.96189767e+02 2.72796165e+00 1.46147328e+02 -6.33990182e+00 -1.44285485e+00 8.99464787e+01
1716.lowfreq: -6.6976 -2.3423 -0.0030 -0.0022 -0.0020 4.0752 14.4269 37.3569 70.4577
frequency: 13.7746 37.3321 70.4510 95.4668 102.8208 128.5518 133.2275 166.1924 183.2229 202.2155 222.2509 293.3544 298.5156 308.6652 312.6599 328.7155 393.4620 395.2946 415.7053 435.8335 456.1475 501.8692 532.5348 592.1204 626.4386 656.9777 670.6962 700.3449 724.3102 731.6548 749.3645 788.0216 854.7339 929.5011 961.7127 982.0403 1046.0471 1074.1805 1126.6990 1131.9101 1164.2793 1201.5460 1215.1182 1227.9164 1246.1450 1264.2495 1316.9407 1359.4798 1391.2573 1421.0905 1431.6260 1475.0373 1478.8964 1480.6278 1500.9078 1514.3903 1565.5382 1591.2277 1607.6379 1642.2259 2986.7361 3008.7420 3017.6897 3074.3681 3110.4238 3127.8357 3147.9459 3150.5005 3624.4419
redmass: 14.4914 8.7764 6.0178 1.9931 1.6074 4.5008 6.7039 9.6575 5.9544 2.5779 1.7370 10.6098 4.9918 6.0659 6.0074 3.2777 10.0867 5.2475 5.1462 4.0256 9.3075 6.2243 1.2367 7.5933 10.1121 6.6681 9.3400 10.9275 9.5001 5.1093 6.0667 8.9076 5.1000 4.6968 1.1083 2.6937 2.6091 1.9213 1.2995 1.3059 1.9257 3.9139 1.7167 1.4542 2.4875 3.4198 4.3207 4.5037 1.8918 1.3377 1.3316 1.0801 1.0427 1.1232 1.0433 4.7316 6.6030 5.8141 2.1783 7.1931 1.0359 1.0744 1.0333 1.1037 1.1026 1.0972 1.0890 1.1018 1.0831
irintensity: 0.2012 0.8378 0.2081 5.4353 2.5369 5.7248 2.2159 2.5640 0.7672 2.4075 0.2722 1.1088 0.5426 0.5307 1.2369 7.3368 5.6237 16.0945 8.3784 18.6371 0.5424 37.5220 139.3614 19.9194 66.1875 7.6161 1.0237 13.5139 46.7296 25.9773 86.1059 8.2869 6.5990 17.6652 145.8526 33.8122 31.3628 21.8055 0.1665 0.0709 23.5743 53.7487 8.5225 6.6682 2.8552 14.6841 59.4773 272.1981 54.6795 15.0654 182.1833 1.2501 18.5068 35.4445 20.7200 148.5064 566.0440 325.4433 545.2980 324.1735 29.6129 258.9264 24.0972 17.5170 14.3179 2.2251 44.1372 0.9374 79.3533
temp: 298.150 k
press: 1.00000 atm
elementType: 17 17 8 8 8 7 7 7 6 6 6 6 6 6 6 6 1 1 1 1 1 1 1 1 1
symmnumber: 1
zpe: 458886.5 jmol-1
zpe.correction: 0.174781 hartree
zpe.thermalcorrener: 0.190757 hartree
zpe.thermalcorrenthalpy: 0.191701 hartree
zpe.thermalcorrgfe: 0.129387 hartree
zpe.sumelectzpe: -1619.152137 hartree
zpe.sumelectthermal: -1619.136161 hartree
zpe.sumelectthermalent: -1619.135217 hartree
zpe.sumelectthermalfe: -1619.197530 hartree
dipole: -6.0144 3.5915 -0.0824
dipole: 7.0056
quadrupole: -121.6751 -94.6257 -107.5682
quadrupole: -12.2312 -0.9390 1.7246
quadrupole: -13.7188 13.3307 0.3881 -12.2312 -0.9390 1.7246
hfenergy: -1619.3269176 hartree
pointgroup: C01 [X(C8H9Cl2N3O3)]
dipole: 2.1029839 -1.772754 0.177578 debye
dipolederiv: -0.5685029 -0.0215329 -0.3338843 -0.0770787 -0.1041654 -0.0975806 -0.244829 -0.0593748 -0.3523555 -0.2942345 0.1106206 0.0849248 0.1189139 -0.2215993 -0.161487 0.0603465 -0.2105322 -0.6065344 -0.852391 0.2608268 -0.0832748 0.2005234 -1.0711468 0.2079498 -0.0825749 0.1988594 -0.366187 -1.3994428 0.0252608 -0.0637111 -0.0551515 -0.5347014 0.0355042 -0.067614 0.0377506 -0.364127 -0.9254736 -0.0699155 0.0040951 -0.4532893 -0.8626628 0.014915 0.0734408 0.0714998 -0.3160033 -1.3948072 -0.1599025 -0.0225481 -0.3804743 -0.8577814 0.1134942 -0.0052422 0.1125133 -0.1974432 -1.4027753 0.2504642 -0.1193823 0.2913514 -0.7808958 0.1402767 -0.1443406 0.1420789 -0.2356347 -0.561547 -0.2148749 0.0601907 -0.0771848 -1.1708463 0.0786095 0.0151682 0.0943536 -0.5590911 -1.4491961 -0.012906 0.0224439 0.237324 -0.950483 0.1606508 -0.1064647 0.1562026 -0.1774114 1.4550135 0.0442404 0.0409657 -0.3679686 1.3024237 -0.1732846 0.1351706 -0.1938384 0.2822141 1.807441 0.0044941 0.0978551 0.1550763 1.3521001 -0.2146129 0.0972524 -0.2114557 0.322649 1.6711282 -0.0392418 0.0892165 0.0446359 1.370341 -0.2958873 0.107739 -0.2621945 0.3075186 0.1032665 -0.223613 0.0348783 -0.2237268 0.3214642 -0.0293161 0.032606 -0.0383587 0.2259194 1.6598064 0.0831626 -0.1066003 0.1819783 0.7021751 0.0189512 -0.1356898 -0.0070864 0.0394867 0.1128527 0.1199927 -0.0317913 0.2173823 0.3286388 -0.0174232 -0.0587717 -0.0161736 0.1957575 0.7319976 0.0266315 0.3086671 0.0271709 0.13049 0.2717807 0.3550853 0.2528081 1.0158461 0.0870299 -0.0229824 0.0925404 0.0604601 -0.0108566 0.0614171 0.0250732 0.0780431 -0.059951 0.038864 0.0386785 -0.013223 -0.1083577 0.2028287 -0.0177321 0.0137219 -0.0080393 0.1433233 0.1022048 -0.0408267 -0.0632726 0.0580728 -0.0649291 -0.0567403 -0.0299644 -0.0820758 -0.0178762 0.1344111 0.1483617 -0.0327119 0.0296045 0.0746345 0.0118519 -0.0051124 0.0222804 0.1230346 0.0086173 -0.0581413 0.1018899 0.0071039 0.0581649 -0.0498434 0.0856011 0.0020423 -0.0154849 0.0336748 -0.0859175 -0.0589255 -0.0328801 0.0623678 0.0098914 -0.0702821 -0.051086 -0.0418641 0.4892896 -0.1723702 0.0181866 -0.0557528 0.3810295 0.0050912 0.0202612 -0.0143579 0.3396339 0.190128 0.0580302 -0.0218198 0.0580782 0.2788834 0.0179959 -0.021847 0.0217584 0.3277619 0.2226449 -0.0485394 -0.0047091 0.1441888 0.0645263 -0.0344719 -0.0487336 -0.0356175 -0.0131815 unknown
polarizability: 195.4932098|-4.6764074|146.1146789|8.6856405|-5.2668054|90.6756847 unknown
InChI: InChI=1S/C8H9Cl2N3O3/c1-12-6(11)3(4(14)5(9)10)7(15)13(2)8(12)16/h5H,11H2,1-2H3
charge 0 multiplicity 1
25 atoms
Cl -4.324344 0.392877 -1.30716
Cl -3.235508 1.336331 1.409389
O  -0.369124 2.119574 -0.722921
O  3.715425 0.017058 0.036696
O  -2.442326 -1.585209 -0.067883
N  1.776055 -1.296697 0.13926
N  1.653957 1.048317 -0.326535
N  -0.161783 -2.634335 0.260457
C  -0.431288 -0.259042 -0.190626
C  0.391556 -1.410932 0.070465
C  2.459567 -0.054159 -0.0458
C  0.218495 1.032508 -0.430282
C  2.616567 -2.480484 0.419937
C  -1.884909 -0.434003 -0.207314
C  2.365427 2.333764 -0.536122
C  -2.797654 0.795492 -0.343393
H  2.376793 -2.907974 1.41037
H  3.661816 -2.139862 0.42591
H  2.494768 -3.245558 -0.368077
H  1.604319 3.095654 -0.752353
H  3.070293 2.240305 -1.377931
H  2.933864 2.599181 0.369768
H  -1.211499 -2.63752 0.184431
H  0.393399 -3.461337 0.467028
H  -2.309967 1.662354 -0.799613
