program: Gaussian 09
title: 000255888
version: EM64L-G09RevD.01
frameworkgroup: C1[X(C10H8BrN5O2)]
method: RPBEPBE
basis: SDD
operation: Freq
keyword: #p
keyword: freq=noraman
keyword: PBEPBE/SDD
title: #p freq=noraman PBEPBE/SDD
converged: NO YES NO NO
title: Mulliken charges:
elementType: Br O O N N N N N C C C C C C C C C C H H H H H H H H
charge: 0.017721 -0.218949 -0.274573 -0.400973 -0.125969 -0.077464 0.047841 -0.609453 0.451455 0.030083 -0.435849 -0.303855 0.197455 0.211763 -0.346116 -0.149024 -0.165228 -0.240614 0.342879 0.236081 0.306908 0.294443 0.253864 0.249072 0.377462 0.331040
chargesum: 0.00000
title: Mulliken charges with hydrogens summed into heavy atoms:
elementType: Br O O N N N N N C C C C C C C C C C
charge: 0.017721 -0.218949 -0.274573 -0.058093 -0.125969 -0.077464 0.047841 0.099048 0.451455 0.030083 -0.199768 0.003053 0.197455 0.211763 -0.051672 0.104840 0.083844 -0.240614
polarizability: 4.17237588e+02 -9.37960225e+00 1.75960109e+02 -3.65422404e-02 -2.43249572e-01 6.05007380e+01
1716.lowfreq: -6.9947 -4.4694 -0.0008 0.0005 0.0006 2.3920 26.6487 42.9888 57.7952
frequency: 26.6414 42.9886 57.7939 72.6950 89.8472 150.5681 175.0039 181.2593 214.1789 267.5079 272.5096 306.4112 331.7226 341.4529 391.1018 410.8837 447.9413 457.0641 511.2236 526.0392 556.8682 585.7312 618.5097 645.8257 662.2972 685.0640 689.0436 709.1178 727.5273 754.1225 756.5068 777.6528 794.2381 821.7080 846.7100 859.7749 911.5780 948.6339 964.1049 988.0927 991.3155 1061.9212 1083.8570 1096.1049 1120.1958 1187.2555 1199.1958 1218.4831 1253.6755 1289.5048 1298.4307 1328.2974 1357.0230 1369.2220 1397.3538 1406.8131 1470.4977 1497.2478 1513.5025 1534.5719 1557.8786 1588.1282 1602.1048 1608.2687 3127.2638 3164.2900 3170.6125 3173.4404 3196.1411 3399.8057 3511.1040 3634.6650
redmass: 9.9988 4.1397 10.9434 8.9453 10.8678 6.9393 9.7078 14.0510 6.8225 9.1637 7.5036 4.7677 5.4507 6.3454 5.5102 2.9899 3.3658 8.6104 2.7752 5.1176 9.1962 1.2708 7.3018 7.6889 6.7070 7.9482 2.4041 3.5305 2.0144 8.9791 1.2656 6.7193 3.5739 1.3906 1.4146 5.3211 3.8350 1.3613 1.4086 1.3206 4.8798 2.4998 3.0966 3.3516 1.4380 1.1191 5.2481 5.5936 2.2263 2.1724 1.3564 5.0246 5.1201 3.6320 4.4898 3.5407 2.5969 2.0545 2.3123 3.9594 4.5350 4.3292 5.3857 3.8179 1.0903 1.0912 1.0931 1.0953 1.0949 1.0539 1.0752 1.0967
irintensity: 1.7437 0.4071 0.9344 0.3554 0.0698 0.5744 0.4684 1.1250 3.4778 2.4798 5.2328 3.1881 0.2335 16.7133 4.1014 0.0321 8.0396 8.0666 36.0833 2.7462 0.7955 136.9001 3.0227 9.5285 13.1688 0.8481 27.9587 2.6792 30.5989 5.4860 37.5466 6.1941 91.6902 61.5005 67.6660 6.9591 10.3770 2.1777 12.4012 2.4670 58.8177 49.6511 75.9772 4.9331 42.9951 1.8598 385.2080 277.7298 82.5860 103.2505 1.0977 234.7605 4.1605 5.4182 46.6043 94.5427 171.4225 4.9932 28.0766 885.2774 562.0102 134.5843 64.0801 345.7537 10.0798 2.4144 0.9092 4.3296 12.9096 104.1413 64.8088 60.9412
temp: 298.150 k
press: 1.00000 atm
elementType: 35 8 8 7 7 7 7 7 6 6 6 6 6 6 6 6 6 6 1 1 1 1 1 1 1 1
symmnumber: 1
zpe: 472441.9 jmol-1
zpe.correction: 0.179944 hartree
zpe.thermalcorrener: 0.195137 hartree
zpe.thermalcorrenthalpy: 0.196081 hartree
zpe.thermalcorrgfe: 0.135070 hartree
zpe.sumelectzpe: -822.206821 hartree
zpe.sumelectthermal: -822.191627 hartree
zpe.sumelectthermalent: -822.190683 hartree
zpe.sumelectthermalfe: -822.251694 hartree
dipole: -3.4393 0.1126 0.0119
dipole: 3.4411
quadrupole: -160.2258 -97.8307 -116.2446
quadrupole: -5.2827 0.1368 -0.1098
quadrupole: -35.4588 26.9363 8.5225 -5.2827 0.1368 -0.1098
hfenergy: -822.3867642 hartree
pointgroup: C01 [X(C10H8Br1N5O2)]
dipole: -1.3528322 -0.0516698 0.0095942 debye
dipolederiv: -0.8775745 -0.2223053 0.0145921 -0.3541484 -0.1569741 0.0087064 0.0220025 0.0084145 -0.0307376 -1.2161744 -0.2049969 0.01673 -0.6621792 -0.5538335 0.0225459 0.048252 0.0214384 -0.2400479 -0.7929677 0.1407514 -0.0074632 0.7251761 -0.8451767 0.0337409 -0.0434087 0.0350491 -0.2901758 -2.1387974 0.0646666 -0.0021683 0.3181859 -0.2755551 -0.0024465 -0.016075 -0.0039598 -0.304139 -1.2177407 0.4173604 -0.0250825 0.9324593 -0.8281087 0.0355956 -0.0559481 0.0359154 -0.2517277 -1.6680359 0.1566466 -0.0063347 -0.3406183 -0.4649796 0.0141047 0.0237395 0.0126317 -0.2554403 2.7839566 -0.0669051 -0.0052381 -0.2950854 1.0615011 -0.0532404 0.0045462 -0.0537185 0.2262091 -0.3763647 0.1120425 -0.0083837 0.3729715 -1.216177 0.0385029 -0.0247755 0.0389757 -0.6191002 1.1627569 0.187564 -0.0107317 0.5760278 0.1007978 0.0002756 -0.0343427 0.0010665 0.1070349 2.4947197 -0.2160395 0.0093755 -0.730882 0.7380661 -0.0337553 0.0454401 -0.0325698 0.2131219 -0.1475178 -0.0310233 0.0030614 -0.0649487 0.0682288 -0.0193415 0.0029791 -0.0191884 -0.1911974 -0.1734202 -0.007812 0.0009396 -0.0302342 -0.065208 -0.007146 0.0002133 -0.0059528 -0.1501527 -1.6845448 -0.1009918 0.0121138 0.7390502 -0.6134801 0.0376386 -0.0392989 0.0397557 0.0041931 1.3144526 -0.2454007 0.0130756 -0.3454648 1.3891454 -0.0744074 0.0173068 -0.073639 0.2417614 1.0288178 -0.2379153 0.0120026 -0.8479442 0.5404034 -0.0301347 0.0508464 -0.0318709 0.0252278 -0.2558267 -0.1622733 0.0117299 -0.3131915 -0.0213061 -0.0047819 0.0252418 -0.0057815 -0.0748508 -0.45827 -0.0730726 0.005512 -0.0326045 0.0605783 -0.0118313 -0.0008146 -0.0109683 -0.0807176 1.2893568 0.4551943 -0.0291424 0.5646733 0.1582632 -0.0205868 -0.0347331 -0.020454 -0.1438881 0.1775138 0.006967 -0.0007511 -0.0900493 0.2235368 0.0059375 0.0039174 0.005786 0.3030945 0.0611975 -0.0793257 0.005093 -0.0509904 -0.084991 0.0192792 0.0026043 0.0187798 0.1689594 0.1689613 0.0519729 -0.005302 0.0580581 0.0499043 0.0086498 -0.0063878 0.0082406 0.165429 0.0503156 -0.0579737 0.0039014 -0.0014277 0.1055789 0.0013743 0.0006787 0.0018395 0.1268659 -0.01919 0.0733857 -0.0063961 0.0739354 0.0537968 0.0086127 -0.0066687 0.0086666 0.1602408 0.0800535 -0.0119943 0.0007565 -0.0458505 -0.0433722 0.0152396 0.0034489 0.0148116 0.1545591 0.267105 0.0556891 -0.0031061 -0.1002974 0.3285405 0.002913 0.0070179 0.0022723 0.3726265 0.1472174 -0.0042107 0.0012166 -0.0546213 0.2908208 0.004555 0.0042182 0.0044596 0.3628519 unknown
polarizability: 417.3460234|7.809743|175.3175955|-0.9278133|-7.8314155|61.0348167 unknown
InChI: InChI=1S/C10H8BrN5O2/c11-6-1-3-7(4-2-6)14-10-13-5-8(16(17)18)9(12)15-10/h1-5,14H,12H2
charge 0 multiplicity 1
26 atoms
Br -6.460175 -1.237735 0.061074
O  5.365826 0.693757 -0.084904
O  4.836498 -1.524577 0.060691
N  -0.817273 1.318407 -0.100507
N  0.719807 -0.506353 0.014977
N  1.421634 1.847112 -0.138613
N  4.491625 -0.25756 -0.018654
N  2.27294 -2.243344 0.120157
C  -2.077276 0.672389 -0.061535
C  0.469449 0.82625 -0.070576
C  -3.229139 1.504744 -0.13167
C  -2.239033 -0.734509 0.045497
C  3.090074 0.077293 -0.032871
C  2.033817 -0.908812 0.035161
C  2.704555 1.443901 -0.11798
C  -4.521931 0.948215 -0.095302
C  -3.534191 -1.291547 0.08129
C  -4.663941 -0.451643 0.01106
H  -0.823114 2.341349 -0.166211
H  -3.118078 2.592832 -0.214263
H  -1.353151 -1.368245 0.097196
H  3.481428 2.212114 -0.169825
H  -5.400917 1.596235 -0.149894
H  -3.655806 -2.375407 0.163171
H  3.253773 -2.55136 0.135557
H  1.478601 -2.880004 0.163673
