program: Gaussian 09
title: 000255885
version: EM64L-G09RevD.01
frameworkgroup: C1[X(C7H16ClO2P)]
method: RPBEPBE
basis: SDD
operation: Freq
keyword: #p
keyword: freq=noraman
keyword: PBEPBE/SDD
title: #p freq=noraman PBEPBE/SDD
converged: NO YES NO NO
title: Mulliken charges:
elementType: Cl P O O C C C C C C C H H H H H H H H H H H H H H H H
charge: -0.232865 1.020805 -0.498311 -0.577565 -0.017833 -0.311083 -0.773451 -0.709870 -0.706353 -0.251236 -0.644605 0.195554 0.230629 0.223933 0.286783 0.304974 0.218289 0.212876 0.219497 0.211110 0.218253 0.216647 0.229601 0.239170 0.214842 0.245309 0.234899
chargesum: 0.00000
title: Mulliken charges with hydrogens summed into heavy atoms:
elementType: Cl P O O C C C C C C C
charge: -0.232865 1.020805 -0.498311 -0.577565 0.177721 0.143479 -0.181694 -0.059208 -0.060343 0.217536 0.050446
polarizability: 1.44426949e+02 2.29937410e+00 1.12761487e+02 2.40993127e+00 -3.63373235e+00 1.00808533e+02
1716.lowfreq: -6.8128 -0.0022 -0.0019 -0.0015 7.5579 10.3334 23.3458 34.0976 42.4189
frequency: 23.3189 33.6478 42.2783 67.8847 79.2110 104.4138 148.1188 167.7366 173.6406 209.5956 212.5896 233.9587 243.1497 248.0273 259.2225 359.4924 377.2789 408.2658 415.6685 442.6899 460.6215 640.2746 722.4201 768.0494 802.5592 818.2778 866.1209 916.9139 919.4126 948.2823 962.4445 1012.4491 1034.3480 1048.5130 1093.5812 1097.7683 1129.8234 1144.2044 1176.4357 1200.3426 1248.1247 1269.4031 1287.4293 1307.4446 1335.2701 1350.2615 1351.3242 1380.6251 1395.7036 1399.0318 1415.5101 1462.0293 1464.4879 1466.8768 1469.8298 1476.4253 1480.7617 1483.5500 1489.9343 2959.2081 2970.7664 2973.5589 2986.3295 2992.9713 3011.8680 3019.2534 3045.9184 3063.9686 3069.5343 3071.8304 3075.8359 3083.0868 3090.8790 3108.8946 3114.4282
redmass: 2.9339 2.7927 4.0153 4.0298 4.3253 2.1487 3.8128 3.1675 4.2548 1.0712 2.6617 3.5764 1.2150 1.5230 4.1066 2.9148 3.1189 3.2536 4.4809 2.5535 3.9826 6.8202 4.7212 1.2657 1.1246 2.5550 3.7386 1.1956 1.4880 1.5047 1.7494 2.9356 5.1647 3.7622 2.1387 1.3851 2.2726 1.5763 1.8106 1.5864 1.2380 1.1154 1.1681 1.3264 1.3718 1.3088 1.3118 1.2093 1.2207 1.2100 1.0806 1.0434 1.0621 1.0703 1.0457 1.0715 1.0579 1.0553 1.0478 1.0831 1.0356 1.0365 1.0594 1.0365 1.0614 1.0604 1.1022 1.0999 1.0995 1.0993 1.0989 1.1032 1.0979 1.1018 1.1036
irintensity: 0.4925 0.1012 0.2492 1.7814 1.3330 0.0208 16.0742 2.9012 4.3246 0.3895 0.6883 4.0722 0.3973 1.0897 3.8619 12.2376 9.3350 16.7761 62.5043 6.3239 40.6749 74.8641 15.4294 17.9514 6.3408 5.3719 165.7579 3.8075 10.9334 0.5022 1.6223 164.7493 55.9989 4.9796 14.9891 11.4538 3.6094 5.5957 12.8674 14.2353 10.6481 0.3548 0.1343 2.7124 7.8556 1.4162 19.8243 21.3778 27.9341 13.4433 5.7756 14.0877 0.8443 4.3011 4.8792 6.1111 12.2464 7.0464 30.0068 20.1146 36.2437 19.0764 14.4921 14.9401 30.3344 4.9438 7.0253 16.5714 30.0546 55.5325 76.6004 4.8485 26.6847 3.4684 27.7540
temp: 298.150 k
press: 1.00000 atm
elementType: 17 15 8 8 6 6 6 6 6 6 6 1 1 1 1 1 1 1 1 1 1 1 1 1 1 1 1
symmnumber: 1
zpe: 587279.0 jmol-1
zpe.correction: 0.223683 hartree
zpe.thermalcorrener: 0.239259 hartree
zpe.thermalcorrenthalpy: 0.240204 hartree
zpe.thermalcorrgfe: 0.178733 hartree
zpe.sumelectzpe: -1227.167470 hartree
zpe.sumelectthermal: -1227.151893 hartree
zpe.sumelectthermalent: -1227.150949 hartree
zpe.sumelectthermalfe: -1227.212420 hartree
dipole: 1.0830 -2.3310 -2.2168
dipole: 3.3942
quadrupole: -68.3338 -85.8355 -91.4608
quadrupole: 3.1582 2.5716 1.0464
quadrupole: 13.5429 -3.9588 -9.5841 3.1582 2.5716 1.0464
hfenergy: -1227.3911528 hartree
pointgroup: C01 [X(C7H16Cl1O2P1)]
dipole: 0.4707959 1.233914 -0.1976595 debye
polarizability: 144.1268636|-4.3971314|101.822107|1.4713325|-4.8583576|112.0479983 unknown
InChI: InChI=1S/C7H16O2P.Cl/c1-4-9-10(8)6-5-7(2)3;/h7H,4-6H2,1-3H3;
charge 0 multiplicity 1
27 atoms
Cl -1.282544 -0.893086 1.681508
P  -1.002704 0.058011 -0.40307
O  -2.056987 1.422333 -0.396404
O  -1.234611 -0.989854 -1.577074
C  3.214165 0.517813 -0.179091
C  1.811894 -0.15235 -0.144462
C  0.665845 0.875651 -0.219676
C  3.448292 1.45054 1.033365
C  4.308009 -0.574053 -0.24591
C  -3.467866 1.26827 -0.875058
C  -4.383646 0.728695 0.225512
H  3.279657 1.127123 -1.106184
H  1.73085 -0.858779 -0.993837
H  1.716326 -0.748287 0.784551
H  0.767244 1.532409 -1.104191
H  0.595492 1.503063 0.683115
H  4.466742 1.879104 1.003615
H  3.346352 0.888923 1.981975
H  2.735979 2.295645 1.05998
H  4.280304 -1.212739 0.657761
H  4.173539 -1.22806 -1.127305
H  5.314708 -0.12161 -0.307583
H  -3.736847 2.296566 -1.167642
H  -3.471499 0.617544 -1.769784
H  -5.4300 0.735878 -0.133212
H  -4.119414 -0.306848 0.499266
H  -4.321076 1.355695 1.130732
