program: Gaussian 09
title: 000250505
version: EM64L-G09RevD.01
frameworkgroup: C1[X(C8H15NO)]
method: RPBEPBE
basis: SDD
operation: Freq
keyword: #p
keyword: freq=noraman
keyword: PBEPBE/SDD
title: #p freq=noraman PBEPBE/SDD
converged: YES YES NO NO
title: Mulliken charges:
elementType: O N C C C C C C C C H H H H H H H H H H H H H H H
charge: -0.426051 -0.062317 -0.423099 -0.349293 -0.292714 0.403868 -0.535740 -0.687647 -0.677327 -0.328167 0.196790 0.199062 0.209525 0.203774 0.247638 0.213022 0.207561 0.209502 0.210731 0.220678 0.218470 0.222787 0.222014 0.231605 0.365327
chargesum: 0.00000
title: Mulliken charges with hydrogens summed into heavy atoms:
elementType: O N C C C C C C C C
charge: -0.060724 -0.062317 -0.027247 0.064005 -0.045076 0.403868 -0.115156 -0.046736 -0.014056 -0.096562
polarizability: 1.47150996e+02 -3.87712397e+00 1.03593354e+02 7.00146575e+00 -3.88672423e+00 6.97168768e+01
1716.lowfreq: -14.2032 -1.3273 -0.0005 0.0003 0.0009 8.5375 23.6187 43.3113 55.5968
frequency: 22.4658 42.5285 55.0111 77.9344 93.7432 135.1682 188.2826 213.5748 226.6824 268.2793 288.0783 315.5416 368.8489 421.7530 428.8025 470.6368 593.5398 619.2290 740.7967 783.3156 803.1230 860.2646 880.3186 899.5369 909.6314 961.2480 972.4835 1034.0476 1050.1867 1058.4478 1073.9481 1088.6863 1139.9308 1196.7983 1225.0486 1233.0498 1262.8201 1269.4231 1285.5983 1303.5141 1333.7482 1352.6925 1387.2090 1388.6358 1395.5990 1459.3549 1472.3646 1473.2720 1475.8657 1478.0068 1485.3226 1490.6545 1557.7653 1651.6513 2953.4660 2973.0609 2977.5484 2980.4830 2981.0003 3021.0229 3042.6310 3046.7845 3051.9184 3071.7294 3074.1422 3077.0383 3082.6517 3090.2008 3568.0145
redmass: 2.7035 2.6854 2.4780 2.0987 3.5547 3.9554 2.7587 1.2643 1.1160 2.3357 3.4272 2.7537 3.6276 1.1224 3.2529 3.3156 3.3130 2.9452 1.1277 1.2214 2.3241 1.6586 1.5852 3.5757 1.6866 1.4851 1.9854 1.9040 2.4226 2.0355 1.6212 1.9724 2.4053 1.9610 1.1611 1.3613 1.2235 1.3379 1.1212 1.3213 1.4167 1.5024 1.2889 1.2156 1.5513 1.0908 1.0423 1.0592 1.0429 1.0535 1.0762 1.0947 6.3186 6.9967 1.0647 1.0355 1.0370 1.0633 1.0619 1.0953 1.0991 1.0890 1.0941 1.1010 1.0993 1.0990 1.1004 1.0898 1.0674
irintensity: 0.0333 0.1852 0.1644 0.0441 0.0730 0.1778 0.3913 0.2404 0.1099 0.2306 0.3080 0.7135 2.5488 168.6038 13.5347 1.3976 13.8784 5.9531 8.1491 3.4365 65.1838 26.6596 2.6299 69.5063 31.6088 28.0107 21.2530 3.7349 9.2414 13.7761 11.5918 7.8242 5.8938 21.5555 35.8727 0.2237 0.2978 0.4497 0.2440 0.5167 0.9906 5.0821 19.1350 6.5983 22.7263 0.4945 13.1067 1.3575 12.3989 0.8978 5.1988 31.2018 5.3244 17.0695 25.5871 49.1115 35.9171 10.0080 49.8717 4.6178 10.5995 22.8214 4.9356 72.4692 47.8883 59.5874 46.8717 26.8531 59.7902
temp: 298.150 k
press: 1.00000 atm
elementType: 8 7 6 6 6 6 6 6 6 6 1 1 1 1 1 1 1 1 1 1 1 1 1 1 1
symmnumber: 1
zpe: 563777.0 jmol-1
zpe.correction: 0.214731 hartree
zpe.thermalcorrener: 0.227653 hartree
zpe.thermalcorrenthalpy: 0.228598 hartree
zpe.thermalcorrgfe: 0.173675 hartree
zpe.sumelectzpe: -442.942577 hartree
zpe.sumelectthermal: -442.929655 hartree
zpe.sumelectthermalent: -442.928711 hartree
zpe.sumelectthermalfe: -442.983633 hartree
dipole: -1.2398 0.4079 0.0060
dipole: 1.3052
quadrupole: -62.1719 -56.4128 -63.8561
quadrupole: -1.7656 1.2500 -1.7001
quadrupole: -1.3583 4.4008 -3.0425 -1.7656 1.2500 -1.7001
hfenergy: -443.1573081 hartree
pointgroup: C01 [X(C8H15N1O1)]
dipole: -0.4830353 -0.1742135 -0.0040145 debye
dipolederiv: -1.4257169 -0.6666143 0.1862348 -0.1710336 -0.1300264 -0.0382107 0.1067787 0.0118936 -0.4068543 0.7790487 0.5442369 -0.1646471 -0.0524862 -0.10876 -0.0043979 -0.0481425 -0.0575323 -0.17014 -0.2149666 0.0148786 -0.0259764 0.1525939 0.1211284 0.0335245 -0.1217655 0.0600454 0.1139571 0.0598384 -0.0131308 0.0140304 -0.1530241 0.1674223 0.024988 0.1709503 0.0084704 0.101689 0.3228859 -0.0601802 -0.0656372 -0.0292548 -0.0472519 0.0083555 -0.1188865 0.0246476 -0.2108345 -0.275218 0.0889043 0.0027946 0.2111299 0.2926095 -0.0111917 -0.0148766 -0.0260587 -0.1233649 0.0821393 0.002204 0.0348131 0.0157593 0.0131781 -0.0411178 0.0636401 -0.0638558 0.1000428 -0.094615 -0.005678 -0.0015172 0.0452669 0.0821234 0.0150188 -0.0937261 0.024973 0.0744331 0.0992145 -0.0063594 -0.0105784 0.0223873 0.0145943 -0.0397724 -0.0253425 0.0016463 -0.0064766 0.4782167 -0.0331631 -0.0616495 -0.1718141 -0.0601147 0.0033307 -0.0534947 -0.0148136 -0.0265302 -0.0474911 0.0452715 0.0899223 0.0050187 0.0413631 -0.0969056 0.0931659 -0.0735291 -0.1042452 0.0425783 -0.0390263 -0.0093014 -0.0772041 -0.1585255 0.0538611 -0.0169901 0.0178303 0.0544044 0.01795 0.0339311 0.0654958 0.0299074 0.0298281 -0.1007966 0.0361316 -0.0706354 -0.1252673 0.0287865 -0.0678979 0.0001904 -0.0416574 -0.1689158 0.0581968 -0.0026374 0.0206068 0.0641027 0.0436634 -0.0102527 0.0144412 -0.047044 -0.0861208 0.0000188 0.0276083 0.0123116 0.1447155 -0.0887216 -0.0965473 0.1155981 -0.0494922 0.0473134 -0.0062691 0.0776556 -0.0018033 0.0055935 -0.0460716 0.094223 -0.139975 0.0694327 -0.0021315 0.0277283 -0.0948966 0.0332658 -0.0260751 0.0452861 0.01065 0.0389378 0.0335227 0.0345765 -0.10668 0.115864 -0.1078532 -0.1093523 0.0598444 -0.0204714 0.0092715 -0.095857 -0.1684477 0.0287354 0.0327533 0.0279453 0.0873835 -0.1011448 0.056124 -0.1034414 0.0672599 0.0644178 0.0732245 -0.14307 0.074011 -0.0515835 0.0970248 -0.0237566 0.0039364 0.0013317 -0.2356803 -0.0278327 0.0164147 -0.0146774 0.0611983 -0.1020169 -0.0378735 0.1164866 -0.0734295 0.0913831 0.0313998 0.0700696 0.0224763 0.0244166 -0.0476102 0.0391643 -0.1226854 0.0721314 0.0657347 0.0561762 -0.0822707 0.0215335 -0.0190794 -0.0269086 0.0843305 0.0164904 0.0977851 -0.0423491 0.0238133 0.020828 0.0288517 0.1682043 0.3140043 0.0670334 -0.0032342 0.1387702 0.1426508 0.0348029 -0.0157609 0.0402503 0.3796626 unknown
polarizability: 146.4769823|5.7003292|104.3091265|-8.5053206|-1.3358906|69.6751176 unknown
InChI: InChI=1S/C8H15NO/c1-3-5-6-8(4-2)7-9-10/h6-7,10H,3-5H2,1-2H3
charge 0 multiplicity 1
25 atoms
O  3.661311 1.523781 -0.276816
N  2.205651 1.389143 -0.113249
C  -1.970994 0.25313 0.740017
C  -2.866689 0.808734 -0.406082
C  -0.508175 0.555547 0.522235
C  0.52576 -0.335037 0.373683
C  0.380281 -1.853224 0.42043
C  -4.36976 0.583074 -0.137298
C  0.4756 -2.501798 -0.986701
C  1.909389 0.128277 0.12887
H  -2.303943 0.726574 1.68883
H  -2.155646 -0.831841 0.846523
H  -2.574516 0.32519 -1.35859
H  -2.66669 1.891546 -0.530861
H  -0.254064 1.624963 0.46041
H  -0.57846 -2.138172 0.886923
H  1.177591 -2.27616 1.065007
H  -4.686203 1.088249 0.794892
H  -4.598052 -0.494102 -0.029282
H  -4.989132 0.978242 -0.96312
H  0.407637 -3.603161 -0.919896
H  1.432348 -2.249316 -1.480173
H  -0.340623 -2.14235 -1.638963
H  2.714608 -0.62665 0.156764
H  3.765574 2.491564 -0.465952
