program: Gaussian 09
title: 000250493
version: EM64L-G09RevD.01
frameworkgroup: C1[X(C15H23NO2)]
method: RPBEPBE
basis: SDD
operation: Freq
keyword: #p
keyword: freq=noraman
keyword: PBEPBE/SDD
title: #p freq=noraman PBEPBE/SDD
converged: YES YES NO NO
title: Mulliken charges:
elementType: O O N C C C C C C C C C C C C C C C H H H H H H H H H H H H H H H H H H H H H H H
charge: -0.285306 -0.204870 -0.006006 -0.050967 -0.433484 -0.450848 -0.407551 -0.403250 -0.386934 -0.234700 0.054469 -0.449981 -0.433939 -0.397769 -0.402310 -0.389017 0.196468 -0.198366 0.235783 0.225272 0.195178 0.221243 0.224371 0.193257 0.205433 0.206875 0.189903 0.201454 0.197765 0.275163 0.234129 0.206355 0.216787 0.235765 0.199642 0.209082 0.200446 0.203234 0.208859 0.206675 0.191688
chargesum: 0.00000
title: Mulliken charges with hydrogens summed into heavy atoms:
elementType: O O N C C C C C C C C C C C C C C C
charge: -0.285306 -0.204870 -0.006006 0.184816 -0.013034 -0.005234 -0.008861 -0.006472 0.012285 0.040464 0.288598 -0.026839 0.001468 0.011760 0.009784 0.009346 0.196468 -0.198366
polarizability: 1.94190528e+02 -8.12190017e+00 1.56816006e+02 2.44637605e+00 -3.00712196e+00 1.44139971e+02
1716.lowfreq: -6.2436 -0.0007 -0.0005 0.0004 5.7289 15.1114 26.6834 33.8356 42.5791
frequency: 22.4030 32.6979 41.9454 70.2750 74.6619 82.5039 120.0692 137.7969 149.6540 208.2409 220.0869 225.6046 244.9678 285.4286 321.7623 325.3161 328.3424 367.9443 407.6770 423.2637 432.4871 435.3098 443.1593 469.8329 495.2429 555.8235 612.3652 705.1906 732.2669 773.4173 786.9152 788.5874 791.7290 836.5212 837.0973 852.2921 875.4975 880.4016 898.5719 899.1321 906.6722 924.0084 928.7755 965.8745 977.6878 997.9140 1041.4219 1043.5173 1054.8714 1057.8158 1061.3651 1080.6739 1082.8578 1108.5318 1113.3964 1117.2568 1139.2856 1152.2827 1164.9369 1200.7333 1222.9964 1240.2128 1244.6670 1254.8334 1258.7061 1261.5719 1273.6410 1277.5042 1300.9180 1307.8153 1313.2264 1321.0149 1331.9717 1336.2364 1336.9378 1342.9163 1343.9288 1344.1691 1347.4940 1352.1455 1360.6985 1365.9441 1461.4643 1463.2244 1464.4460 1465.6526 1465.7187 1467.0352 1470.7255 1473.6739 1477.9351 1481.3317 1640.1058 2203.1732 2964.6162 2966.2022 2969.1739 2972.3542 2972.9969 2973.0936 2974.8366 2976.3663 2981.7987 2985.4345 2989.3656 3008.1130 3012.8630 3025.2414 3032.2171 3033.8143 3036.6758 3036.8241 3039.4739 3047.1939 3047.3090 3056.2550 3064.4976
redmass: 4.2153 3.6609 3.0090 5.1188 5.2023 4.4662 5.3695 4.7341 3.5743 3.2911 1.8173 1.9763 4.4494 4.4194 2.0588 3.0869 2.3725 5.0556 7.0726 2.4731 2.8591 3.1216 2.8931 2.1650 1.6407 2.7019 6.5439 5.0923 4.8964 2.8350 1.9159 1.5772 1.6603 3.4556 2.4840 1.6564 2.5064 2.0298 1.6627 1.5525 2.0616 1.8015 2.2206 3.2204 2.5963 2.7872 2.0817 2.2618 1.0784 1.7167 1.5212 1.3403 1.3323 2.6418 2.7156 2.8613 1.8958 2.3030 1.4204 1.5119 1.3355 1.3156 1.2998 1.2833 1.3087 1.2798 1.2991 1.3311 1.1901 1.3335 1.4430 1.3301 1.3453 1.4137 1.4261 1.4592 1.4956 1.4759 1.4264 1.5489 1.4998 1.4737 1.0880 1.0882 1.0886 1.0899 1.0904 1.0918 1.0834 1.0820 1.0954 1.0979 10.7058 12.5709 1.0618 1.0641 1.0618 1.0630 1.0655 1.0661 1.0621 1.0631 1.0781 1.0617 1.0634 1.0821 1.0834 1.0983 1.0965 1.0990 1.1016 1.0967 1.0981 1.1029 1.1014 1.1023 1.1027
irintensity: 0.2233 0.3972 0.0610 0.2802 1.1264 1.1624 3.1987 2.2139 1.3018 4.7690 0.2246 0.9129 0.3549 0.5513 1.2440 1.9437 3.0014 2.6146 4.4897 1.2926 0.6915 0.4248 1.5038 0.7183 0.8698 2.1501 3.6015 9.4264 0.6780 1.7260 2.9621 0.0669 1.7049 4.2014 6.8096 3.4363 6.1403 1.0337 6.3705 21.5312 16.7833 0.1391 1.1764 24.0699 12.9266 95.5091 16.2362 31.4691 0.1185 12.3592 34.5508 18.0408 3.6083 64.9832 108.3981 142.9447 19.5543 1.5005 16.0497 0.5976 3.7378 1.4916 37.4561 3.7177 1.9342 1.8289 0.4033 55.1409 5.1377 0.5019 16.2735 2.1114 0.4381 1.5600 0.6625 1.9192 0.8888 0.4945 0.1041 1.3720 4.0821 2.1500 5.3344 1.4351 7.3981 4.5015 9.8177 12.2479 19.8635 24.5005 2.6651 3.4026 145.7303 7.1104 25.2195 41.4489 26.8312 39.6795 28.1567 5.6625 34.9141 30.6928 15.6298 11.7599 19.4887 2.3114 20.1599 70.1832 68.4784 14.9414 8.8527 50.6752 61.0642 71.0310 77.5916 16.8435 72.3848
temp: 298.150 k
press: 1.00000 atm
elementType: 8 8 7 6 6 6 6 6 6 6 6 6 6 6 6 6 6 6 1 1 1 1 1 1 1 1 1 1 1 1 1 1 1 1 1 1 1 1 1 1 1
symmnumber: 1
zpe: 931610.5 jmol-1
zpe.correction: 0.354832 hartree
zpe.thermalcorrener: 0.372800 hartree
zpe.thermalcorrenthalpy: 0.373744 hartree
zpe.thermalcorrgfe: 0.307312 hartree
zpe.sumelectzpe: -789.194537 hartree
zpe.sumelectthermal: -789.176568 hartree
zpe.sumelectthermalent: -789.175624 hartree
zpe.sumelectthermalfe: -789.242057 hartree
dipole: 3.0361 -4.6079 2.7732
dipole: 6.1759
quadrupole: -102.2332 -122.2686 -111.9171
quadrupole: 10.7534 -3.2080 7.9066
quadrupole: 9.9064 -10.1290 0.2225 10.7534 -3.2080 7.9066
hfenergy: -789.5493684 hartree
pointgroup: C01 [X(C15H23N1O2)]
dipole: -1.2579729 2.0292146 0.4512211 debye
polarizability: 194.7596039|-7.0812505|156.6682903|-1.3201777|-1.4946981|143.7186113 unknown
InChI: InChI=1S/C15H23NO2/c16-11-14(12-7-3-1-4-8-12)15(17)18-13-9-5-2-6-10-13/h12-14H,1-10H2
charge 0 multiplicity 1
41 atoms
O  -1.07401 -0.310488 0.841273
O  -0.435411 -1.874686 -0.777145
N  2.828614 -3.01451 0.442481
C  1.89366 0.41984 0.293432
C  3.177389 0.731504 1.102217
C  2.186843 0.386542 -1.226576
C  3.833747 2.050768 0.628002
C  2.846168 1.706473 -1.697008
C  4.128356 2.016902 -0.89027
C  1.228702 -0.914418 0.814129
C  -2.497192 -0.336672 0.339174
C  -3.377131 0.081705 1.523515
C  -2.64453 0.607651 -0.86595
C  -4.862431 0.147027 1.084143
C  -4.129398 0.666529 -1.307991
C  -5.049415 1.083031 -0.134753
C  -0.157484 -1.124676 0.181707
C  2.097452 -2.085613 0.596506
H  1.150073 1.218512 0.496912
H  3.899412 -0.100591 0.975869
H  2.938695 0.792225 2.183068
H  1.256728 0.199889 -1.796866
H  2.867616 -0.461189 -1.444799
H  3.154772 2.900614 0.849151
H  4.765926 2.229508 1.197488
H  3.078083 1.640194 -2.777207
H  2.126196 2.54276 -1.575515
H  4.561137 2.982035 -1.2169
H  4.888292 1.235865 -1.097896
H  1.075124 -0.794524 1.90457
H  -2.71352 -1.377178 0.026855
H  -3.047658 1.077019 1.881278
H  -3.245606 -0.629936 2.359317
H  -2.005242 0.260468 -1.697644
H  -2.303013 1.619433 -0.569512
H  -5.48381 0.488764 1.93314
H  -5.214325 -0.871569 0.820648
H  -4.440266 -0.329683 -1.684161
H  -4.236035 1.372154 -2.153196
H  -6.107229 1.076436 -0.460059
H  -4.81058 2.124385 0.164372
