program: Gaussian 09
title: 000255865
version: EM64L-G09RevD.01
frameworkgroup: C1[X(C7H12N2O)]
method: RPBEPBE
basis: SDD
operation: Freq
keyword: #p
keyword: freq=noraman
keyword: PBEPBE/SDD
title: #p freq=noraman PBEPBE/SDD
converged: YES YES NO NO
title: Mulliken charges:
elementType: O N N C C C C C C C H H H H H H H H H H H H
charge: -0.260891 -0.367412 -0.020932 -0.331435 -0.397408 -0.353060 -0.683553 0.233489 -0.519360 -0.139136 0.217317 0.199292 0.214540 0.260316 0.193923 0.199911 0.338359 0.213725 0.219937 0.209668 0.287112 0.285597
chargesum: 0.00000
title: Mulliken charges with hydrogens summed into heavy atoms:
elementType: O N N C C C C C C C
charge: -0.260891 -0.029053 -0.020932 0.085174 0.077448 0.040774 -0.040223 0.233489 0.053350 -0.139136
polarizability: 9.75951577e+01 4.79081270e-01 9.90784985e+01 5.99654029e+00 6.76438384e+00 6.93276700e+01
1716.lowfreq: -10.4701 -8.0382 -0.0007 -0.0006 -0.0004 11.2640 19.2243 41.3508 66.0280
frequency: 17.9678 41.2993 65.8726 72.8872 130.3444 134.9203 218.0197 229.2780 284.8592 303.9693 357.2015 394.9815 476.0125 489.9873 580.0231 627.6172 640.4210 732.7819 788.7578 846.0343 876.1408 930.5471 953.7437 971.6436 979.8933 1047.3523 1098.2184 1121.0369 1137.4188 1194.5862 1221.0387 1229.1744 1261.6866 1281.8247 1288.9579 1311.7749 1351.0410 1364.0441 1391.4766 1423.7716 1457.2173 1458.9025 1473.1367 1478.1055 1485.3452 1504.0796 1637.7774 2188.5449 2962.2181 2976.0456 2980.1974 2996.4805 3007.5245 3018.3620 3046.0402 3072.8486 3074.2795 3077.1726 3079.9458 3530.0295
redmass: 4.1921 4.7978 1.9954 2.5959 5.5695 2.7645 3.3499 1.1799 2.4251 3.4763 3.2191 3.9910 6.5406 2.7102 3.2933 1.2171 4.1397 1.2308 1.7800 2.1490 1.7954 2.2598 2.2717 2.1643 1.9302 3.2662 3.3772 2.0687 1.9473 1.1095 2.1459 1.3332 1.3212 1.4241 1.1089 1.2441 1.4536 1.3597 1.2109 1.0857 1.0904 1.0860 1.0638 1.0432 1.0764 1.7603 8.1895 12.4056 1.0590 1.0372 1.0597 1.0666 1.0976 1.0594 1.1008 1.1006 1.0998 1.0996 1.1003 1.0779
irintensity: 0.1480 6.4067 3.2852 15.0957 8.3523 2.7520 4.6980 0.8458 2.6058 1.4122 0.3743 18.2272 1.2146 5.4739 26.5649 90.7593 9.1219 13.8480 2.9389 1.8465 2.1830 6.5068 3.8348 4.5715 10.7184 1.6953 1.0212 3.2086 3.6117 0.7057 78.9174 11.6669 43.8443 0.7260 0.2213 15.7988 0.6744 3.1686 9.8358 30.4547 27.1281 7.4627 7.6236 11.5912 15.1300 185.7657 271.5528 17.5321 25.6233 24.3942 52.2952 31.3879 3.4950 0.0979 42.6301 77.0401 0.2004 38.2770 14.9524 26.5842
temp: 298.150 k
press: 1.00000 atm
elementType: 8 7 7 6 6 6 6 6 6 6 1 1 1 1 1 1 1 1 1 1 1 1
symmnumber: 1
zpe: 480736.5 jmol-1
zpe.correction: 0.183103 hartree
zpe.thermalcorrener: 0.194875 hartree
zpe.thermalcorrenthalpy: 0.195819 hartree
zpe.thermalcorrgfe: 0.143071 hartree
zpe.sumelectzpe: -457.884131 hartree
zpe.sumelectthermal: -457.872359 hartree
zpe.sumelectthermalent: -457.871415 hartree
zpe.sumelectthermalfe: -457.924163 hartree
dipole: 1.5753 -0.0609 0.4973
dipole: 1.6530
quadrupole: -56.5233 -78.2777 -59.1362
quadrupole: 2.1840 2.9465 -4.4214
quadrupole: 8.1224 -13.6319 5.5095 2.1840 2.9465 -4.4214
hfenergy: -458.0672337 hartree
pointgroup: C01 [X(C7H12N2O1)]
dipole: -0.6492447 -0.0315748 -0.0211824 debye
dipolederiv: -0.6666207 -0.0362597 -0.0052812 0.2340949 -0.9287463 0.3171833 -0.1955197 0.3072854 -0.5345773 -1.2032138 0.1256889 -0.0523879 0.1184 -0.4382276 -0.0020096 -0.1496344 0.0290512 -0.5250176 -0.2165902 0.051354 -0.0249401 -0.097488 -0.33472 0.0467805 0.0583872 0.0720822 -0.2590223 0.0515816 0.0442483 0.0385061 -0.0017918 0.0678728 -0.0328282 0.0488049 -0.0220486 0.0400583 0.5285574 0.0733357 -0.0347418 0.3109449 0.1214948 0.0557728 -0.0787634 0.0343569 0.291376 0.1094651 0.0327393 0.0736944 0.03451 0.061365 -0.0046811 0.0980025 -0.0012607 0.0875272 0.0265166 0.0521152 0.0522067 0.0660413 0.0358904 -0.03773 0.0331348 -0.0204653 0.041599 1.4911208 0.108264 0.1181379 -0.2285903 1.1079017 -0.5003524 0.4197159 -0.5019801 0.4921701 -0.1672863 -0.1762887 0.033374 -0.168326 -0.1598012 0.1634979 0.0135487 0.1536836 0.1108663 -0.1560863 -0.1723537 0.0766708 0.0312492 0.210909 -0.1375269 -0.0443929 -0.1734493 0.052907 0.0337383 0.0281525 -0.0963072 0.0272982 0.0394889 -0.0228239 -0.0720336 0.0052748 -0.1115367 -0.1416467 -0.1258387 0.0332662 -0.0837286 -0.0412697 0.0124472 0.0381542 0.0071443 0.0806985 -0.0625422 -0.035739 -0.0697745 -0.0396801 0.1073471 0.0334599 -0.0678388 -0.0336335 -0.1267654 0.0552815 0.0966243 0.0118269 -0.0084126 -0.0503627 -0.0091098 0.0432355 0.0380172 0.0885217 0.0256533 0.024847 -0.0803006 0.0086492 0.0418426 -0.0311332 -0.0859256 0.0038193 -0.1795761 -0.1135407 -0.1216921 0.042923 -0.1209204 -0.0344767 0.0232583 0.021972 0.0198376 0.0548261 0.2210492 0.0136666 -0.0643965 -0.0438582 0.1679206 0.0721045 -0.0704868 0.0633853 0.2889544 0.0277022 -0.0014214 -0.1159449 0.0036716 0.0955958 0.0105485 -0.0586571 -0.0275342 -0.1395616 0.0391367 0.0901243 0.0115687 0.129162 -0.1566904 0.021597 -0.0024084 0.0533255 0.0708586 -0.0949532 -0.0971628 0.037403 -0.1577175 -0.0067868 0.012072 0.0225135 -0.0181155 0.0716139 0.0804782 0.0343625 0.0412234 0.0318841 0.0424206 0.0055509 0.0787973 0.0100069 0.0807468 0.1321992 -0.0087665 -0.0267264 -0.0453917 0.0510321 0.0039222 -0.0506058 0.0012172 0.023333 unknown
polarizability: 98.708376|-2.6017468|94.3921412|-1.3029306|-12.7847196|72.900809 unknown
InChI: InChI=1S/C7H12N2O/c1-2-3-6-9-7(10)4-5-8/h9H,2-4,6H2,1H3
charge 0 multiplicity 1
22 atoms
O  1.09317 -1.987277 0.336438
N  -0.187935 -0.442765 -0.860363
N  1.81713 2.258195 -1.827843
C  -2.412736 -0.581417 0.325181
C  -1.460119 -1.182083 -0.734508
C  -2.898052 0.849762 -0.001559
C  -3.890825 1.391214 1.049617
C  0.982009 -0.902309 -0.304564
C  2.244231 -0.011367 -0.504922
C  2.034807 1.245766 -1.232582
H  -1.907633 -0.593283 1.310679
H  -3.29128 -1.25291 0.41003
H  -1.955114 -1.195466 -1.724975
H  -1.196709 -2.218948 -0.463921
H  -3.378827 0.854021 -1.001817
H  -2.028069 1.534694 -0.065244
H  -0.189041 0.455425 -1.349833
H  -3.426117 1.424233 2.052769
H  -4.226593 2.413652 0.798515
H  -4.787418 0.746701 1.116397
H  2.995489 -0.630167 -1.029063
H  2.65343 0.198032 0.500169
