program: Gaussian 09
title: 000250489
version: EM64L-G09RevD.01
frameworkgroup: C1[X(C15H14O2)]
method: RPBEPBE
basis: SDD
operation: Freq
keyword: #pfreq=noraman
keyword: PBEPBE/SDD
title: #p freq=noraman PBEPBE/SDD
converged: YES YES NO NO
title: Mulliken charges:
elementType: O O C C C C C C C C C C C C C C C H H H H H H H H H H H H H H
charge: -0.334482 -0.222044 0.326311 0.281942 0.476870 -0.528349 -0.378657 -0.406554 -0.816889 -0.809112 0.237032 0.142024 -0.336277 -0.338616 -0.223023 -0.218362 -0.222429 0.253817 0.230780 0.229911 0.223069 0.268519 0.232162 0.227383 0.225094 0.235232 0.269906 0.274793 0.234216 0.232401 0.233331
chargesum: 0.00000
title: Mulliken charges with hydrogens summed into heavy atoms:
elementType: O O C C C C C C C C C C C C C C C
charge: -0.334482 -0.222044 0.326311 0.281942 0.476870 -0.274531 -0.147877 -0.176643 -0.093139 -0.121403 0.237032 0.142024 -0.066371 -0.063823 0.011193 0.014039 0.010902
polarizability: 2.49069321e+02 5.27627598e-01 1.45545466e+02 -4.31310595e+00 1.08941587e+01 1.13922720e+02
1716.lowfreq: -23.8758 -2.3886 -0.0006 0.0002 0.0007 3.8717 7.5171 31.0874 37.6802
frequency: -23.8087 30.9129 37.6408 60.8037 79.2431 126.9607 149.9728 161.3005 172.2998 221.1501 272.8414 290.0313 309.6725 322.1263 404.2835 418.6836 435.8105 449.6519 456.3051 485.4536 561.9004 587.8433 614.0341 670.7092 675.0434 701.6065 706.9790 726.5473 750.0503 790.5278 795.9950 824.1391 865.9048 890.5587 912.9687 955.8435 956.1914 988.7211 990.3577 997.4756 1008.3935 1009.5632 1013.9944 1036.2616 1046.4336 1050.6295 1083.9508 1092.9462 1156.9533 1174.1982 1181.8108 1208.4762 1231.3689 1256.2943 1278.6804 1315.2059 1368.2826 1390.0966 1396.1949 1397.0509 1407.9556 1438.2073 1464.3070 1469.0013 1473.2468 1477.2485 1485.5387 1503.2220 1580.2511 1586.8341 1611.1252 1631.9046 1638.1954 2975.4114 2981.8591 3057.1079 3063.6808 3085.7667 3090.3785 3119.7288 3131.0404 3142.7407 3143.6803 3148.3906 3155.9162 3167.7459 3180.8909
redmass: 1.0123 4.5480 4.2727 5.5470 5.5834 2.3849 2.2443 4.9288 1.6577 4.1840 3.8632 4.4308 3.7952 3.5654 2.8338 4.9290 3.9110 3.7252 3.9562 3.9794 4.0921 8.0282 6.4395 5.8959 5.0798 1.6205 3.8476 4.7300 4.7161 4.3995 2.2681 1.3429 1.2439 1.4599 3.2998 1.3456 1.4164 1.9411 5.8433 1.3849 1.4193 1.3276 3.1282 2.2443 1.5519 1.5320 1.6606 2.9983 1.3651 1.0577 1.1386 1.6984 4.4300 5.0056 1.4139 1.3178 5.4325 10.0049 1.2436 1.2773 3.1327 2.2432 1.0660 1.0951 1.0541 2.2358 1.1002 3.2567 5.6716 6.4929 6.0738 7.5499 11.1513 1.0386 1.0365 1.0951 1.0976 1.0998 1.0994 1.0872 1.0856 1.0955 1.0892 1.0936 1.0940 1.0983 1.0974
irintensity: 0.5333 0.8017 0.5763 1.1871 0.8286 2.5521 0.5893 0.1419 1.1395 1.0117 1.8675 1.9121 6.1875 0.9840 0.0021 1.6812 1.0311 4.9840 2.7633 1.1846 5.9910 8.3555 1.1495 4.8150 17.1169 85.2908 2.5008 2.1581 4.2941 9.6182 18.8978 37.7487 0.0332 11.1897 0.2284 0.5769 3.4676 25.0650 3.0858 0.0284 16.7390 0.3191 197.7500 99.3377 10.8803 31.5818 15.4744 243.6500 6.8629 0.4275 61.8201 25.8587 369.0511 4.6030 1.3028 0.8122 4.6363 2.8984 19.2910 3.8142 4.4731 15.5463 21.7290 6.2878 13.9831 3.1933 43.9598 48.2263 13.0842 18.1738 13.8925 17.0210 160.1618 39.2600 23.2373 21.7957 9.9177 18.2500 25.0905 10.7720 0.2067 33.2441 10.6694 2.0993 16.4745 23.5263 7.1869
temp: 298.150 k
press: 1.00000 atm
elementType: 8 8 6 6 6 6 6 6 6 6 6 6 6 6 6 6 6 1 1 1 1 1 1 1 1 1 1 1 1 1 1
symmnumber: 1
zpe: 644528.2 jmol-1
zpe.correction: 0.245488 hartree
zpe.thermalcorrener: 0.260288 hartree
zpe.thermalcorrenthalpy: 0.261232 hartree
zpe.thermalcorrgfe: 0.202355 hartree
zpe.sumelectzpe: -729.257310 hartree
zpe.sumelectthermal: -729.242510 hartree
zpe.sumelectthermalent: -729.241566 hartree
zpe.sumelectthermalfe: -729.300443 hartree
dipole: 0.7701 -1.0163 -1.5233
dipole: 1.9865
quadrupole: -75.6454 -93.9576 -102.6147
quadrupole: -0.4918 -0.6485 -0.8589
quadrupole: 15.0939 -3.2184 -11.8755 -0.4918 -0.6485 -0.8589
hfenergy: -729.502798 hartree
pointgroup: C01 [X(C15H14O2)]
dipole: -0.3071394 -0.0893037 -0.7131072 debye
polarizability: 248.955046|5.3878787|121.6747569|2.3655938|-17.3403673|137.9077043 unknown
InChI: InChI=1S/C15H14O2/c1-11-8-9-12(2)14(10-11)17-15(16)13-6-4-3-5-7-13/h3-10H,1-2H3
charge 0 multiplicity 1
31 atoms
O  0.049585 -0.068064 -0.4288
O  -0.485074 0.204025 1.838975
C  2.03703 -1.250427 0.464819
C  1.464139 -0.12104 -0.169436
C  3.639779 0.941397 -0.529884
C  2.230007 0.950824 -0.662656
C  3.448926 -1.243309 0.591539
C  4.236039 -0.173628 0.112003
C  1.195167 -2.397393 0.983742
C  4.482585 2.079674 -1.078443
C  -2.264701 0.112746 0.168483
C  -0.853036 0.0931 0.648849
C  -3.290512 0.275102 1.136487
C  -2.600358 -0.024337 -1.204078
C  -4.641276 0.300523 0.73529
C  -3.954144 0.002035 -1.600151
C  -4.975444 0.164182 -0.633695
H  1.716053 1.788712 -1.1460
H  3.935251 -2.096074 1.079989
H  5.325303 -0.205943 0.234179
H  1.823558 -3.274476 1.212581
H  0.663852 -2.101967 1.907366
H  0.428039 -2.702834 0.248729
H  3.937573 3.039481 -1.048226
H  5.417987 2.200366 -0.504395
H  4.764963 1.894672 -2.133221
H  -3.006433 0.37955 2.188927
H  -1.801083 -0.149052 -1.939468
H  -5.431653 0.425977 1.483016
H  -4.21462 -0.103534 -2.658815
H  -6.025806 0.184108 -0.945506
