program: Gaussian 09
title: 000255851
version: EM64L-G09RevD.01
frameworkgroup: C1[X(C6H4O4S)]
method: RPBEPBE
basis: SDD
operation: Freq
keyword: #pfreq=noraman
keyword: PBEPBE/SDD
title: #p freq=noraman PBEPBE/SDD
converged: NO YES NO NO
title: Mulliken charges:
elementType: S O O O O C C C C C C H H H H
charge: 0.372714 -0.432119 -0.423647 -0.241479 -0.240838 0.423430 -0.266804 -0.232344 -0.662175 0.112113 0.188595 0.315705 0.306230 0.389409 0.391211
chargesum: 0.00000
title: Mulliken charges with hydrogens summed into heavy atoms:
elementType: S O O O O C C C C C C
charge: 0.372714 -0.042710 -0.032436 -0.241479 -0.240838 0.423430 0.048901 -0.232344 -0.355944 0.112113 0.188595
polarizability: 1.44264308e+02 -4.37163088e-01 1.03634128e+02 -2.53701365e-03 3.88628772e-03 3.61673283e+01
1716.lowfreq: -2.3395 -0.0020 0.0005 0.0021 9.2372 9.6295 64.6373 73.9537 112.6280
frequency: 64.6190 73.9262 112.6279 134.5867 203.6279 211.6097 319.1301 360.0074 420.4977 439.3423 516.7511 533.7866 574.5547 589.7052 622.7085 623.5883 684.4259 712.9464 725.6187 813.2176 826.0386 900.3228 927.4080 966.0685 1043.2803 1096.7548 1154.1011 1185.1005 1287.1546 1310.7743 1388.0178 1474.1872 1544.1785 1641.2539 1651.7660 3215.0500 3234.1264 3529.2559 3532.3126
redmass: 10.8414 15.4827 8.5515 5.6405 8.2103 6.2281 11.3449 9.6642 12.3914 4.6325 7.3264 1.9498 1.2611 5.1609 4.4687 1.4920 5.8188 7.3879 3.5043 5.4124 1.5432 8.1288 1.4401 7.0402 2.4538 1.4678 1.5710 1.3988 2.1782 3.1412 6.8796 9.1894 7.3512 8.7470 8.9466 1.0960 1.0957 1.0643 1.0644
irintensity: 0.2042 1.5322 0.5665 0.9875 3.4367 0.1172 5.1024 3.4462 10.8705 6.5235 8.4962 133.3533 37.7468 49.1094 53.3557 108.0159 2.2420 65.2669 48.9238 34.2739 23.5640 12.5488 22.5196 225.6000 178.9120 164.3740 155.9270 0.9829 39.3390 57.1318 36.8284 120.4210 13.2984 591.3804 94.8491 8.2861 8.0751 50.8547 57.1936
temp: 298.150 k
press: 1.00000 atm
elementType: 16 8 8 8 8 6 6 6 6 6 6 1 1 1 1
symmnumber: 1
zpe: 243107.7 jmol-1
zpe.correction: 0.092595 hartree
zpe.thermalcorrener: 0.102614 hartree
zpe.thermalcorrenthalpy: 0.103558 hartree
zpe.thermalcorrgfe: 0.056068 hartree
zpe.sumelectzpe: -929.207326 hartree
zpe.sumelectthermal: -929.197307 hartree
zpe.sumelectthermalent: -929.196362 hartree
zpe.sumelectthermalfe: -929.243853 hartree
dipole: -0.5646 1.9073 0.0002
dipole: 1.9891
quadrupole: -75.1878 -61.9600 -70.4426
quadrupole: 1.4848 0.0014 0.0006
quadrupole: -5.9910 7.2368 -1.2458 1.4848 0.0014 0.0006
hfenergy: -929.2999207 hartree
pointgroup: C01 [X(C6H4O4S1)]
dipole: 0.1971945 -0.7573204 0.000084 debye
dipolederiv: -0.1321215 0.204693 -0.0000289 0.1098934 -0.0055308 0.0000089 -0.0000458 0.0000103 0.1951866 -0.3873187 0.1896949 -0.0000115 0.3364434 -1.2596196 0.0000387 -0.0000075 -0.0000568 -0.42833 -0.4039267 -0.2379443 0.0000183 -0.4520445 -1.2482155 0.0000752 0.0000981 0.0002795 -0.4251281 -1.1655287 -0.1696423 -0.0000642 -0.1085402 -0.6415685 -0.000032 0.0000609 0.0000384 -0.3319457 -1.1296 0.1667632 -0.0001358 0.0991991 -0.6535168 0.0001188 0.0001127 -0.0000269 -0.3270115 -0.6627256 0.1820334 -0.0000204 0.1886511 -0.4412163 0.0000233 -0.0000629 0.0000339 0.0224081 0.3666631 0.1856324 0.0000157 0.0394598 -0.128115 0.0000045 -0.0000388 0.0000128 -0.0563396 -0.9814545 -0.2201138 0.0000095 0.0120151 0.2427817 0. -0.0001044 -0.0000485 -0.1610588 0.1536577 -0.3334189 0.0000465 -0.2911431 0.2095696 -0.0000341 0.0000089 -0.0000345 -0.2348893 1.8797852 -0.2265608 0.0000796 -0.3566838 1.5476917 -0.0000033 0.0000285 -0.0000038 0.263114 1.9475848 0.2555852 0.0000814 0.4198664 1.4760154 -0.0002194 -0.0000761 -0.0002294 0.2758445 0.1656455 0.0228419 -0.0000056 -0.0188415 0.0783795 0.0000036 0.0000003 0.0000043 0.1919417 0.0867656 -0.0278543 -0.0000069 0.0079015 0.1091314 0.0000018 -0.0000021 0.0000047 0.2063009 0.1202946 -0.0134528 0.0000068 -0.0869607 0.3623206 -0.0000068 0.0000172 -0.0000084 0.4042584 0.1422791 0.0217431 0.0000155 0.1007839 0.3518926 0.0000207 0.000011 0.0000243 0.4056489 unknown
polarizability: 144.1910287|-1.7785119|103.7074073|0.0024072|-0.003968|36.1673283 unknown
InChI: InChI=1S/C6H4O4S/c7-5(8)3-1-4(6(9)10)11-2-3/h1-2,7,9H
charge 0 multiplicity 1
15 atoms
S  -0.849606 1.918997 -0.000151
O  2.605659 -1.692809 0.000091
O  -2.661022 -1.720713 0.000188
O  3.598404 0.415793 0.000048
O  -3.597047 0.418672 -0.000083
C  1.169216 0.209529 0.000062
C  -0.016191 -0.60725 0.000013
C  -1.187713 0.137986 -0.000136
C  0.888091 1.578103 -0.000024
C  2.561268 -0.2890 0.000188
C  -2.580402 -0.318564 -0.000255
H  -0.001861 -1.697744 0.000062
H  1.612354 2.391608 -0.000009
H  3.556635 -1.985747 0.000027
H  -3.620982 -1.981863 0.000378
