program: Gaussian 09
title: 000255859
version: EM64L-G09RevD.01
frameworkgroup: C1[X(C10H18FNO3)]
method: RPBEPBE
basis: SDD
operation: Freq
keyword: #p
keyword: freq=noraman
keyword: PBEPBE/SDD
title: #p freq=noraman PBEPBE/SDD
converged: YES YES NO NO
title: Mulliken charges:
elementType: F O O O N C C C C C C C C C C H H H H H H H H H H H H H H H H H H
charge: -0.187501 -0.253735 -0.223200 -0.234467 -0.300818 -0.107120 0.219052 -0.720355 -0.721664 0.061097 0.175855 -0.250536 -0.257443 -0.680833 -0.665064 0.252642 0.232881 0.235533 0.210371 0.212946 0.237783 0.227430 0.224175 0.215259 0.231643 0.233989 0.250401 0.210458 0.230922 0.243214 0.218838 0.245985 0.232262
chargesum: 0.00000
title: Mulliken charges with hydrogens summed into heavy atoms:
elementType: F O O O N C C C C C C C C C C
charge: -0.187501 -0.253735 -0.223200 -0.234467 -0.050416 0.145522 0.219052 -0.041571 -0.043505 0.061097 0.175855 0.188898 0.208189 0.003762 0.032020
polarizability: 1.48013994e+02 1.04104747e+00 1.16307511e+02 2.95028953e+00 -3.06789298e+00 1.16322504e+02
1716.lowfreq: -16.7458 -9.4049 -8.4527 -0.0009 -0.0002 0.0006 7.5117 23.8572 52.2682
frequency: -9.2610 23.7208 52.2236 67.8830 85.5102 89.5100 94.6445 108.1452 156.8399 168.2308 189.6576 201.7865 219.1685 240.1330 249.4969 257.6592 285.5129 307.2819 311.7781 322.8805 350.0738 389.6976 421.4799 428.0405 495.8631 571.7609 603.9525 692.4083 712.4449 740.4690 793.4133 799.5514 815.0045 828.0906 831.4547 882.2177 924.5216 947.0278 969.5925 980.4082 989.4086 1020.5449 1028.2499 1042.4848 1094.4285 1108.7588 1133.1313 1134.3750 1140.5611 1155.3135 1183.6218 1197.0396 1208.0455 1260.7997 1274.9628 1303.0300 1323.1233 1352.0725 1358.9265 1380.3108 1388.5836 1398.7172 1399.6026 1455.2995 1461.7533 1464.6123 1469.0377 1470.5020 1476.2637 1483.6914 1484.5184 1486.7882 1490.7520 1612.3838 1635.6948 2963.0742 2984.8140 2990.8985 2993.0006 2998.9195 3024.2137 3031.3758 3037.2026 3076.8655 3084.8050 3088.3207 3090.8100 3095.5483 3095.6772 3097.9791 3110.7304 3122.7721 3382.6339
redmass: 4.5781 3.7409 3.1375 2.9975 3.4848 3.2307 2.1917 3.4048 3.8378 2.9712 2.5370 1.1029 1.2201 1.4011 1.3610 3.3866 3.5904 5.0613 2.8297 4.1904 3.6026 3.2359 3.4137 3.7894 5.6801 3.7874 3.9374 4.5901 4.1569 3.2772 1.8047 1.9120 1.4838 1.4540 2.1187 2.6224 1.1998 1.7572 2.3412 2.9455 2.1317 3.1022 3.2118 2.4724 2.1781 2.2682 1.5297 2.2491 2.4634 1.6918 2.3606 4.6970 3.3027 1.1413 1.1229 1.4108 1.4256 1.2868 1.3597 1.2055 1.2327 1.2434 1.2118 1.1016 1.0394 1.0426 1.0438 1.0513 1.0563 1.0477 1.0521 1.0734 1.0509 9.7790 7.1008 1.0557 1.0354 1.0357 1.0359 1.0363 1.1075 1.0601 1.0843 1.0994 1.0993 1.0975 1.1001 1.0990 1.1022 1.0995 1.1016 1.1066 1.0771
irintensity: 1.5571 1.2263 1.5677 0.3304 0.5136 0.7168 2.0096 1.2448 1.9858 1.2796 1.3017 0.0298 1.2921 2.7051 0.2550 0.7575 2.9240 9.3376 12.4524 3.2186 3.0467 4.0749 3.1871 1.8793 4.7313 4.0594 24.8020 19.0586 26.4717 9.3442 51.2118 29.1736 9.5889 2.8105 3.8137 1.3718 3.1087 33.4605 48.1430 42.2207 71.1847 145.2674 64.4143 91.4548 20.9059 23.2554 11.3997 50.8048 32.0466 20.5635 45.1049 137.6319 223.8633 0.0639 5.5699 0.4633 0.6098 1.1588 2.2393 13.6318 24.5938 26.2898 17.0580 11.9773 13.0259 16.0948 3.2775 4.7329 8.6616 8.5553 19.9404 6.3121 14.9448 144.9962 96.5466 30.6259 29.9094 24.3421 17.3386 19.0960 25.9680 27.0533 1.2796 39.9066 26.7419 32.1129 22.7370 29.7377 2.9888 31.8061 28.0665 28.4711 11.2052
temp: 298.150 k
press: 1.00000 atm
elementType: 9 8 8 8 7 6 6 6 6 6 6 6 6 6 6 1 1 1 1 1 1 1 1 1 1 1 1 1 1 1 1 1 1
symmnumber: 1
zpe: 710262.2 jmol-1
zpe.correction: 0.270525 hartree
zpe.thermalcorrener: 0.288099 hartree
zpe.thermalcorrenthalpy: 0.289044 hartree
zpe.thermalcorrgfe: 0.224772 hartree
zpe.sumelectzpe: -770.895437 hartree
zpe.sumelectthermal: -770.877863 hartree
zpe.sumelectthermalent: -770.876918 hartree
zpe.sumelectthermalfe: -770.941190 hartree
dipole: -1.6934 -1.4191 -2.0601
dipole: 3.0208
quadrupole: -65.9661 -86.0518 -99.8640
quadrupole: 1.1355 -3.0248 -5.4537
quadrupole: 17.9945 -2.0912 -15.9034 1.1355 -3.0248 -5.4537
hfenergy: -771.165962 hartree
pointgroup: C01 [X(C10H18F1N1O3)]
dipole: -0.6208974 0.5182836 0.8708362 debye
polarizability: 147.6235222|-1.1944081|116.6396833|-4.5974644|-2.9804671|116.380804 unknown
InChI: InChI=1S/C10H18FNO3/c1-5-14-8(12)10(11,7(3)4)9(13)15-6-2/h7,12H,5-6H2,1-4H3
charge 0 multiplicity 1
33 atoms
F  0.48398 -1.072816 -1.823112
O  -2.086979 0.394247 0.225512
O  2.222871 0.555591 -0.849034
O  0.891167 1.269986 0.926857
N  -1.415462 0.888967 -2.071119
C  -0.179848 -1.607888 0.455839
C  0.023555 -0.467881 -0.588702
C  -1.204806 -2.64259 -0.062415
C  1.168229 -2.286971 0.793572
C  -1.256886 0.338488 -0.910247
C  1.080087 0.549376 -0.08171
C  -3.259649 1.301178 0.159931
C  3.296725 1.518284 -0.433869
C  -3.911721 1.275564 1.539194
C  4.202155 0.890471 0.628479
H  -0.582516 -1.120816 1.362348
H  -2.185941 -2.178636 -0.263198
H  -0.84504 -3.118348 -0.991412
H  -1.352036 -3.43283 0.695785
H  0.998839 -3.113127 1.507107
H  1.636683 -2.705336 -0.114649
H  1.883023 -1.584346 1.259463
H  -2.909965 2.318672 -0.107356
H  -3.955035 0.941036 -0.62559
H  3.832099 1.715481 -1.375531
H  2.81576 2.440329 -0.062875
H  -2.29386 1.423401 -2.208421
H  -4.794154 1.940796 1.553515
H  -4.240135 0.254599 1.797823
H  -3.199977 1.618916 2.308269
H  5.044914 1.572677 0.84588
H  3.648297 0.719054 1.566754
H  4.617529 -0.068327 0.273613
