program: Gaussian 09
title: 000255825
version: EM64L-G09RevD.01
frameworkgroup: C1[X(C14H18O3)]
method: RPBEPBE
basis: SDD
operation: Freq
keyword: #pfreq=noraman
keyword: PBEPBE/SDD
title: #p freq=noraman PBEPBE/SDD
converged: YES YES NO NO
title: Mulliken charges:
elementType: O O O C C C C C C C C C C C C C C H H H H H H H H H H H H H H H H H H
charge: -0.276929 -0.270958 -0.266077 -0.305097 -0.121707 -0.367640 -0.739799 0.484060 0.264594 -0.433101 -0.410156 -0.354319 -0.352374 0.318932 -0.224153 -0.673340 -0.538142 0.279065 0.248912 0.274947 0.260386 0.214236 0.215311 0.239362 0.239426 0.239185 0.249093 0.226986 0.225002 0.210143 0.229914 0.228314 0.220039 0.220991 0.244894
chargesum: 0.00000
title: Mulliken charges with hydrogens summed into heavy atoms:
elementType: O O O C C C C C C C C C C C C C C
charge: -0.276929 -0.270958 -0.266077 -0.026032 0.127205 -0.092694 -0.049866 0.484060 0.264594 -0.193738 -0.170730 -0.115135 -0.103281 0.318932 0.227834 -0.004969 0.147782
polarizability: 2.26279645e+02 -3.21022852e+00 1.67875780e+02 -5.92589398e+00 -2.78933994e+00 1.02483794e+02
1716.lowfreq: -0.0008 -0.0005 0.0007 3.1739 6.9979 9.3542 13.3094 27.2732 52.7506
frequency: 12.0289 27.2327 52.7435 53.9716 80.6320 94.9099 123.5048 130.2778 173.7878 192.4816 195.6589 206.4348 224.1758 246.0476 253.9621 286.7557 304.6746 356.8291 376.2275 414.0406 422.5243 436.6139 466.3187 513.0570 553.5928 629.1961 646.0234 703.2729 727.6382 747.6722 768.2874 798.4969 806.5411 814.7910 820.4093 842.4905 870.2267 918.5335 943.8471 965.3715 986.1669 989.0138 999.3063 1007.7179 1031.3322 1052.8364 1075.6412 1106.8805 1110.3109 1112.4214 1115.0848 1126.0780 1136.3317 1149.9504 1156.5539 1177.4117 1204.6291 1224.2491 1238.4123 1247.9785 1288.8644 1298.7170 1339.7675 1361.2535 1373.4457 1399.3528 1400.6613 1415.0247 1431.9996 1440.2487 1462.9616 1467.2989 1473.9454 1474.1371 1476.4361 1484.7205 1487.4946 1507.9552 1578.6451 1618.2183 1624.8451 2957.6910 2979.6726 2995.0585 3008.0517 3044.6346 3063.4758 3065.7147 3075.6926 3086.6251 3091.7961 3106.1789 3107.3289 3123.6531 3127.6925 3131.9765 3159.2882 3160.3718 3166.1700
redmass: 3.5655 3.5231 3.3283 3.0089 5.0623 3.4281 3.6077 3.5671 2.4289 1.8625 3.0394 1.4278 3.5276 1.3582 1.4101 2.9147 4.8901 3.9298 3.6378 2.9491 4.1021 3.9773 3.5030 3.1386 3.4691 6.8488 5.8061 3.7596 4.2287 4.0994 5.0556 1.1173 2.3338 3.2743 1.4281 1.8296 3.6278 3.0594 1.3510 1.3514 1.5716 4.9762 2.6518 2.3348 2.4468 1.9067 1.1260 2.0501 1.4631 1.2609 1.7912 1.9434 1.4737 2.0048 1.3350 1.2218 2.1815 2.1780 1.8343 1.1358 1.5359 1.2867 1.3970 3.4552 1.8450 1.2402 1.2959 3.7029 1.7978 1.5114 1.0404 1.0501 1.0645 1.0646 1.0916 1.0533 1.0720 2.7830 7.3630 9.7529 6.5145 1.0331 1.0367 1.0358 1.0581 1.1038 1.0989 1.1065 1.0876 1.0940 1.0986 1.1024 1.0927 1.0986 1.0894 1.0889 1.0903 1.0939 1.0958
irintensity: 0.6297 0.3641 0.3915 0.5608 3.8378 1.0388 4.3939 2.8082 2.9428 0.7301 0.4849 0.6980 6.0839 1.5571 0.4808 5.6004 5.3893 3.5321 9.4395 0.1253 3.4357 2.7114 0.0231 19.4957 17.0500 0.6891 0.9333 2.7485 1.0307 13.9505 4.0047 5.8341 36.9983 8.1647 0.8221 41.6036 59.1772 9.1187 0.3835 0.6538 18.6536 34.9023 5.1356 4.3420 61.2933 27.2957 11.0785 172.5269 47.3226 0.3326 75.6604 143.6993 9.2441 99.7517 0.8998 50.1451 15.9676 173.3793 18.3519 0.0137 32.3474 8.8200 63.9461 12.4859 33.7121 19.6586 28.6648 0.9146 118.1623 20.3266 11.4877 13.2759 30.3470 22.9494 14.9616 6.1279 13.8491 111.0107 10.8696 137.7341 58.3724 68.1039 42.9980 23.9192 22.6703 50.2596 28.8270 10.5102 1.1981 2.6746 33.3081 44.7845 18.4529 33.4120 6.1543 13.6462 2.8285 16.5148 5.6829
temp: 298.150 k
press: 1.00000 atm
elementType: 8 8 8 6 6 6 6 6 6 6 6 6 6 6 6 6 6 1 1 1 1 1 1 1 1 1 1 1 1 1 1 1 1 1 1
symmnumber: 1
zpe: 755481.6 jmol-1
zpe.correction: 0.287748 hartree
zpe.thermalcorrener: 0.305643 hartree
zpe.thermalcorrenthalpy: 0.306587 hartree
zpe.thermalcorrgfe: 0.239446 hartree
zpe.sumelectzpe: -768.646409 hartree
zpe.sumelectthermal: -768.628514 hartree
zpe.sumelectthermalent: -768.627570 hartree
zpe.sumelectthermalfe: -768.694711 hartree
dipole: 0.3420 -2.3881 -1.0762
dipole: 2.6417
quadrupole: -91.0057 -88.9374 -106.3675
quadrupole: -3.0321 4.0740 -4.3068
quadrupole: 4.4312 6.4995 -10.9306 -3.0321 4.0740 -4.3068
hfenergy: -768.9341567 hartree
pointgroup: C01 [X(C14H18O3)]
dipole: 0.1041175 -0.8214563 -0.6281385 debye
polarizability: 225.9645901|-3.2963071|165.8503446|-7.6611444|12.2577894|104.8242848 unknown
InChI: InChI=1S/C14H18O3/c1-4-17-14(15)13-9(2)12(13)10-5-7-11(16-3)8-6-10/h5-9,12-13H,4H2,1-3H3
charge 0 multiplicity 1
35 atoms
O  -3.578067 -0.715513 -0.586901
O  -3.343067 0.493998 1.396697
O  4.982409 -0.602818 -0.385245
C  -0.451018 1.015195 0.589985
C  -1.145919 2.087358 -0.237064
C  -1.616659 0.596912 -0.343654
C  -2.005961 3.169448 0.396425
C  0.95247 0.560665 0.293779
C  -2.89466 0.160488 0.26846
C  1.258214 -0.808772 0.11344
C  2.019169 1.498455 0.240604
C  2.582318 -1.247119 -0.116358
C  3.343638 1.083031 0.014096
C  3.629933 -0.293971 -0.164143
C  -4.884738 -1.233761 -0.07867
C  -5.410539 -2.20539 -1.130702
C  5.330989 -2.012478 -0.572277
H  -0.741345 1.009289 1.650627
H  -0.601235 2.400502 -1.138006
H  -1.35933 0.081478 -1.272621
H  -2.573249 2.777949 1.257548
H  -1.370156 4.003458 0.748559
H  -2.72923 3.579525 -0.332588
H  0.446705 -1.545719 0.146646
H  1.803224 2.564365 0.378488
H  2.781011 -2.314283 -0.253934
H  4.170084 1.799123 -0.028723
H  -4.712275 -1.718236 0.899618
H  -5.561865 -0.374839 0.080353
H  -6.382678 -2.619601 -0.806204
H  -5.554936 -1.697185 -2.099451
H  -4.707689 -3.042995 -1.279254
H  4.822667 -2.440207 -1.458681
H  5.079454 -2.61294 0.323881
H  6.419529 -2.020911 -0.729826
