program: Gaussian 09
title: 000255928
version: EM64L-G09RevD.01
frameworkgroup: C1[X(C25H20O8)]
method: RPBEPBE
basis: SDD
operation: Freq
keyword: #pfreq=noraman
keyword: PBEPBE/SDD
title: #p freq=noraman PBEPBE/SDD
converged: NO NO NO NO
title: Mulliken charges:
elementType: O O O O O O O O C C C C C C C C C C C C C C C C C C C C C C C C C H H H H H H H H H H H H H H H H H H H H
charge: -0.298734 -0.312415 -0.285688 -0.391793 -0.207673 -0.245994 -0.232840 -0.257131 -0.014746 -0.135756 -0.361368 0.166178 0.226778 0.206834 0.207952 0.217963 0.217025 0.224349 -0.339238 -0.338061 -0.334278 -0.326394 -0.339815 -0.335560 -0.223584 -0.225995 -0.219188 -0.217957 -0.220217 -0.218320 -0.219621 -0.217814 -0.221059 0.278413 0.340553 0.253393 0.267689 0.269240 0.293433 0.385577 0.270812 0.267823 0.267798 0.270612 0.234425 0.234991 0.236702 0.235167 0.232866 0.235376 0.233651 0.232479 0.233155
chargesum: 0.00000
title: Mulliken charges with hydrogens summed into heavy atoms:
elementType: O O O O O O O O C C C C C C C C C C C C C C C C C C C C C C C C C
charge: -0.298734 -0.312415 -0.285688 -0.006216 -0.207673 -0.245994 -0.232840 -0.257131 0.263667 0.204796 0.159714 0.166178 0.226778 0.206834 0.207952 0.217963 0.217025 0.224349 -0.069998 -0.044628 -0.063466 -0.058571 -0.072017 -0.064948 0.010842 0.008997 0.017514 0.017211 0.012650 0.017056 0.014031 0.014665 0.012096
polarizability: 3.82972186e+02 3.43078226e+01 2.76098375e+02 -2.86300449e+01 7.40872926e+00 2.31251041e+02
1716.lowfreq: -16.8711 -4.9803 -1.3307 -0.0006 -0.0004 0.0004 5.4481 13.4309 14.5957
frequency: -16.7943 13.3385 14.4351 20.6670 25.3372 29.0760 29.6530 41.5593 42.4375 54.9055 58.6035 66.4669 86.6670 94.6217 107.1973 129.9894 145.2625 154.4555 162.6698 184.2845 206.7726 226.2127 252.2118 268.7083 296.1671 316.1470 325.6457 358.9413 392.6436 402.0057 403.8464 404.3730 409.8610 421.8741 437.6659 441.9406 443.2501 450.0675 489.4176 512.2776 553.5214 613.6025 613.9875 614.0336 615.9759 638.6856 657.2445 661.6659 665.9681 676.4634 677.2581 680.8920 699.7459 700.3463 703.5098 750.6929 767.6696 774.6467 794.9802 795.1687 795.6717 800.8847 845.1199 864.0736 864.9166 867.2687 874.1423 940.8645 954.9832 956.0362 958.6995 961.8192 989.1828 990.2568 990.5366 996.0168 996.8651 999.1115 1009.3259 1009.4759 1010.1965 1010.9667 1015.9160 1018.5176 1023.0427 1036.2789 1039.4251 1044.4669 1060.6618 1067.7244 1086.8815 1087.6066 1089.2709 1145.1459 1174.4103 1174.4910 1175.7874 1182.4520 1184.1446 1187.0336 1225.2000 1234.5717 1236.8866 1248.1180 1259.0225 1271.7418 1303.7466 1315.5468 1317.1162 1319.7352 1332.1319 1372.6577 1389.9308 1389.9952 1390.4357 1391.1650 1438.1635 1439.0247 1439.0788 1445.6714 1477.8721 1478.4599 1478.9812 1584.8303 1585.4997 1586.4563 1611.4482 1611.6090 1611.9264 1624.9603 1628.2360 1639.6845 1667.8460 3040.8596 3052.4881 3068.4932 3130.7484 3131.1432 3131.3311 3133.7221 3144.1527 3144.5280 3146.2968 3155.8186 3156.4467 3157.9684 3166.9722 3168.4455 3169.6214 3176.0820 3181.5755 3182.1305 3510.9933
redmass: 6.2330 6.1133 6.5976 6.6028 7.3853 4.6418 6.1320 6.7522 5.7729 5.6531 6.6110 6.6358 8.7813 6.6803 6.7328 6.7984 5.7095 5.7480 5.6511 4.4818 7.7333 7.7294 5.3542 9.1210 8.5037 7.5732 3.9025 6.0938 6.1802 2.8145 2.8294 2.8448 4.3472 6.8236 3.9286 3.9975 4.1295 5.1005 5.0723 4.1489 4.6241 6.4417 6.4394 6.3479 2.3527 3.0524 6.2238 4.4118 6.3518 5.1761 5.0303 5.1327 1.6143 1.6185 1.6032 6.0486 5.1136 7.3137 2.3567 2.1377 2.3370 4.4824 4.8916 1.2465 1.2449 1.2444 3.8796 6.5015 1.4794 1.4247 1.4154 5.8286 6.0053 6.0026 6.2744 1.4048 1.3879 1.3972 1.4417 2.7005 1.3414 1.4052 3.8764 3.7161 2.6619 2.6406 2.7052 2.9359 2.9959 2.3494 1.6633 1.6204 1.7668 2.9812 1.0584 1.0594 1.0565 1.1314 1.1353 1.1201 1.6516 3.2954 2.1445 3.4185 1.2704 1.6669 1.2204 1.3172 1.3120 1.3095 1.4083 1.4260 7.2096 9.9112 2.5399 3.3313 2.2391 2.2527 2.2574 1.0985 2.2756 2.2767 2.2715 6.5046 6.5934 6.4190 6.0932 6.0577 6.0574 10.4544 10.6320 11.8069 9.0085 1.0842 1.0588 1.0850 1.1069 1.0856 1.0856 1.0857 1.0892 1.0890 1.0891 1.0937 1.0940 1.0939 1.0974 1.0983 1.0981 1.0997 1.0979 1.0971 1.0641
irintensity: 1.5035 0.1036 0.3003 0.1391 3.2786 1.0398 0.9629 0.1369 1.1875 0.2856 2.0152 1.7335 0.1699 0.3196 0.5593 0.3948 0.6357 0.0551 0.3630 1.2425 1.2978 4.3131 11.3228 0.9184 1.6227 8.1897 28.8745 8.6899 14.3166 0.0322 0.0314 0.0498 7.5407 2.3207 1.2145 4.5722 1.6025 2.8174 7.4034 17.8011 20.9542 0.5087 0.4208 3.5806 115.3260 61.7814 11.5511 18.6936 6.7091 17.3903 24.4330 18.2814 76.9625 106.5558 92.1931 2.1889 16.2297 4.4209 11.2704 28.9966 20.5756 21.6788 16.0302 0.4212 0.0935 0.0660 3.6506 6.6708 5.5879 3.4770 3.6733 9.3428 5.2749 10.5956 3.4578 0.8806 0.1561 1.0441 13.6267 85.4705 0.6638 9.7014 187.4542 251.9238 124.5731 93.3979 359.0758 107.7760 153.6649 238.3837 23.3299 32.9379 13.4132 51.7382 0.6867 1.4148 0.1263 46.4291 65.2628 22.7395 105.2389 272.3785 287.1346 279.7732 20.1033 5.1018 57.4642 1.6973 0.9550 0.8882 24.2155 29.8941 0.5445 5.1625 11.3796 3.9286 17.2115 14.0610 21.3574 23.1210 5.3905 3.3824 7.7386 31.1533 21.6615 17.5194 17.0294 19.4719 10.8970 47.4212 279.1306 217.2261 159.0605 10.0333 16.5634 13.6411 3.7898 0.3412 0.8543 0.3709 10.2120 10.7949 8.8995 14.0725 16.7049 14.1285 14.2043 21.4750 22.0938 15.9619 7.8354 6.6975 32.8682
temp: 298.150 k
press: 1.00000 atm
elementType: 8 8 8 8 8 8 8 8 6 6 6 6 6 6 6 6 6 6 6 6 6 6 6 6 6 6 6 6 6 6 6 6 6 1 1 1 1 1 1 1 1 1 1 1 1 1 1 1 1 1 1 1 1
symmnumber: 1
zpe: 1038089.1 jmol-1
zpe.correction: 0.395387 hartree
zpe.thermalcorrener: 0.424284 hartree
zpe.thermalcorrenthalpy: 0.425228 hartree
zpe.thermalcorrgfe: 0.329147 hartree
zpe.sumelectzpe: -1564.145566 hartree
zpe.sumelectthermal: -1564.116669 hartree
zpe.sumelectthermalent: -1564.115725 hartree
zpe.sumelectthermalfe: -1564.211806 hartree
dipole: -1.0204 2.0149 -0.3979
dipole: 2.2933
quadrupole: -144.0886 -170.1503 -194.1093
quadrupole: 14.4485 -0.4461 -11.2001
quadrupole: 25.3608 -0.7009 -24.6599 14.4485 -0.4461 -11.2001
hfenergy: -1564.5409529 hartree
pointgroup: C01 [X(C25H20O8)]
dipole: 0.5381341 0.6929919 -0.210332 debye
polarizability: 325.6689414|-64.6703325|338.3101985|9.9655432|9.2237426|226.3424621 unknown
InChI: InChI=1S/C25H20O8/c26-22(27)21(33-25(30)19-14-8-3-9-15-19)20(32-24(29)18-12-6-2-7-13-18)16-31-23(28)17-10-4-1-5-11-17/h1-15,20-21,26H,16H2
charge 0 multiplicity 1
53 atoms
O  -1.308544 0.180923 0.134716
O  0.987777 -2.680469 0.797409
O  1.336598 1.432069 0.370397
O  -2.393772 -2.237946 1.851359
O  -0.485274 -1.889796 3.135356
O  -1.849683 -0.809691 -1.907322
O  0.161448 -4.545123 -0.351422
O  -0.04922 2.754045 1.718543
C  -0.038611 -0.575031 0.169281
C  -0.325257 -2.02426 0.66087
C  0.899608 0.21009 1.085533
C  -1.026744 -2.042001 2.022205
C  -2.132212 0.005217 -0.99599
C  1.104574 -3.986033 0.250848
C  -3.316651 0.900644 -0.950086
C  0.755477 2.652583 0.761041
C  2.456298 -4.556588 0.486656
C  1.235162 3.782841 -0.084257
C  -4.301297 0.752173 -1.962458
C  -3.472145 1.890464 0.057376
C  2.764226 -5.798947 -0.128805
C  3.420246 -3.911264 1.305784
C  0.780278 5.089818 0.23268
C  2.114609 3.585645 -1.181186
C  -5.439264 1.582928 -1.963943
C  -4.612802 2.720369 0.046972
C  4.029419 -6.387038 0.067628
C  4.683573 -4.50723 1.50153
C  -5.596967 2.567882 -0.958968
C  4.991104 -5.742229 0.882318
C  1.201603 6.190234 -0.540746
C  2.532262 4.690338 -1.952762
C  2.078078 5.992513 -1.634718
H  0.370189 -0.647678 -0.85567
H  -0.937675 -2.557017 -0.086402
H  1.812855 -0.373284 1.275921
H  0.407524 0.489501 2.031509
H  -4.154325 -0.014103 -2.730826
H  -2.69982 2.006827 0.823406
H  -2.85815 -2.18566 2.731133
H  2.00268 -6.281223 -0.750476
H  3.167838 -2.963223 1.788169
H  0.101991 5.21698 1.082811
H  2.457928 2.574799 -1.416128
H  -6.200701 1.466322 -2.742426
H  -4.733055 3.487541 0.819232
H  4.267232 -7.343745 -0.409151
H  5.426446 -4.013231 2.136646
H  -6.481428 3.214931 -0.961677
H  5.973949 -6.201487 1.03617
H  0.850167 7.19799 -0.294957
H  3.208688 4.538749 -2.80072
H  2.404466 6.848282 -2.23631
