program: Gaussian 09
title: 000255848
version: EM64L-G09RevD.01
frameworkgroup: C1[X(C14H15Br2N3O)]
method: RPBEPBE
basis: SDD
operation: Freq
keyword: #p
keyword: freq=noraman
keyword: PBEPBE/SDD
title: #p freq=noraman PBEPBE/SDD
converged: YES YES NO NO
title: Mulliken charges:
elementType: Br Br O N N N C C C C C C C C C C C C C C H H H H H H H H H H H H H H H
charge: -0.001148 0.000770 -0.278963 -0.159147 -0.637622 -0.043722 -0.392625 -0.394707 0.451377 -0.375711 -0.380747 -0.675424 -0.674675 0.497720 -0.448094 -0.338467 -0.338421 0.155313 0.169737 -0.310555 0.258738 0.259688 0.258394 0.261459 0.240069 0.240964 0.308861 0.287350 0.309474 0.286215 0.241034 0.257504 0.275848 0.350515 0.338996
chargesum: 0.00000
title: Mulliken charges with hydrogens summed into heavy atoms:
elementType: Br Br O N N N C C C C C C C C C C C C C C
charge: -0.001148 0.000770 -0.278963 -0.159147 0.051890 -0.043722 0.125801 0.125146 0.451377 -0.135642 -0.139783 -0.079212 -0.078986 0.497720 -0.207061 -0.080962 -0.062574 0.155313 0.169737 -0.310555
polarizability: 4.26702582e+02 1.22542812e+01 2.47422275e+02 7.44602134e+00 3.00856735e+01 1.05801657e+02
1716.lowfreq: -4.4864 -2.5691 -0.0006 -0.0006 -0.0003 3.1862 18.7720 22.4780 23.6921
frequency: 18.7091 22.4706 23.6819 28.5885 61.5361 67.7536 76.6882 82.3320 105.8096 125.7128 132.5768 151.8575 167.2968 192.6815 201.6077 213.5844 254.5266 269.3845 323.5515 352.1931 397.8936 413.2869 428.2515 432.2829 500.3321 503.3603 511.7594 538.3869 545.2110 568.7509 598.2723 621.5191 622.7035 632.3874 663.0036 730.8459 737.6562 744.7812 767.9312 775.4155 783.5294 809.8659 829.8563 843.3837 938.1513 952.3516 968.4554 972.2904 992.9526 1002.4429 1012.0379 1028.3684 1033.2359 1052.8039 1076.2364 1107.7210 1147.2642 1181.2245 1212.7600 1214.2948 1225.9792 1229.8351 1250.2739 1278.2826 1292.4813 1330.0148 1338.5199 1346.2061 1348.8176 1356.9916 1385.3836 1396.3500 1448.4382 1454.3810 1455.8116 1483.9592 1503.4821 1515.6091 1547.1185 1569.4983 1605.2191 1626.1098 1645.6507 2130.2161 3019.8549 3024.2998 3060.8244 3061.2556 3075.7436 3080.8498 3087.6434 3129.1200 3146.2262 3146.7327 3154.9710 3164.0713 3178.7677 3516.3292 3670.7835
redmass: 11.0125 15.1529 13.7254 9.2387 5.1263 3.4443 5.3847 6.8257 2.9623 2.7962 15.6614 9.0851 5.6463 6.1967 4.7177 3.9669 4.5847 5.9901 3.6626 4.8647 3.6756 3.3454 3.2397 5.5420 3.9663 5.6953 2.4771 5.3429 1.4013 1.5266 4.8677 2.0721 5.2026 5.2282 4.6080 4.1094 5.3320 4.5830 1.1881 1.1877 4.9759 1.2851 1.6464 5.3886 2.4586 1.3465 1.3419 1.3575 2.9208 1.4281 1.5048 4.8140 4.1604 1.8880 3.7985 1.6509 1.5391 1.6265 1.2264 2.0172 1.1664 1.1640 1.7080 1.3283 1.1730 1.5106 3.1495 1.2782 1.4989 2.4424 2.3106 1.9684 2.5342 1.1133 1.2497 1.1118 1.1800 2.4177 5.8774 3.3353 1.9890 5.7473 3.4679 12.5897 1.0602 1.0608 1.0567 1.0569 1.1044 1.1044 1.0876 1.0892 1.1115 1.1114 1.0878 1.0939 1.0955 1.0454 1.1041
irintensity: 0.1398 0.2669 0.2337 0.3970 6.6302 1.5972 7.7529 1.1590 1.4272 1.6021 0.8023 9.2897 3.0334 8.0281 4.4413 4.0751 0.4621 1.7754 3.2441 8.7383 5.8896 5.4793 1.4140 9.3438 24.8187 5.9702 8.4231 4.5675 5.8050 251.0168 116.2735 56.3688 9.9807 6.7513 71.4611 4.5358 27.4685 0.9307 4.4561 13.8887 1.0199 5.9072 62.3516 0.9101 32.2852 0.6677 1.4817 0.0174 1.3910 14.1156 6.0629 1.7597 2.6236 22.1227 0.5136 58.2810 4.3888 191.2129 217.0921 31.2187 16.6731 33.7402 64.0409 95.1231 5.4906 49.1656 533.0054 4.4405 9.8090 11.6035 29.5107 96.8231 30.7246 4.4594 24.3230 25.8891 26.7915 526.0758 1.0805 578.5307 39.7650 442.7027 285.5342 90.0766 20.1581 20.5888 5.3885 20.3008 6.3490 5.7788 0.9876 7.2642 2.1077 10.8741 11.5638 23.0911 8.7696 76.2277 52.8565
temp: 298.150 k
press: 1.00000 atm
elementType: 35 35 8 7 7 7 6 6 6 6 6 6 6 6 6 6 6 6 6 6 1 1 1 1 1 1 1 1 1 1 1 1 1 1 1
symmnumber: 1
zpe: 700101.9 jmol-1
zpe.correction: 0.266655 hartree
zpe.thermalcorrener: 0.287485 hartree
zpe.thermalcorrenthalpy: 0.288429 hartree
zpe.thermalcorrgfe: 0.211362 hartree
zpe.sumelectzpe: -807.425113 hartree
zpe.sumelectthermal: -807.404282 hartree
zpe.sumelectthermalent: -807.403338 hartree
zpe.sumelectthermalfe: -807.480405 hartree
dipole: -2.9539 -0.1431 -0.1053
dipole: 2.9593
quadrupole: -143.6200 -160.5519 -138.8175
quadrupole: 5.2467 2.2656 -1.7010
quadrupole: 4.0432 -12.8888 8.8456 5.2467 2.2656 -1.7010
hfenergy: -807.6917673 hartree
pointgroup: C01 [X(C14H15Br2N3O1)]
dipole: 1.1497602 0.1373903 -0.1212653 debye
polarizability: 421.9467939|27.5227601|171.6068353|-16.7042093|-78.7796355|186.3728841 unknown
InChI: InChI=1S/C14H15Br2N3O/c15-5-7-19(8-6-16)13-3-1-11(2-4-13)9-12(10-17)14(18)20/h1-4,9H,5-8,18H2
charge 0 multiplicity 1
35 atoms
Br 5.132991 3.266802 -2.129075
Br 4.881224 -2.953772 2.213553
O  -5.38283 0.675463 -1.288455
N  3.018824 0.151835 -0.079433
N  -6.178756 -0.642762 0.450853
N  -3.527184 -1.905612 2.310042
C  3.857715 0.846171 -1.077431
C  3.723067 -0.541811 1.018392
C  1.617213 0.15318 -0.170844
C  0.937831 0.878609 -1.202265
C  0.809396 -0.573483 0.765234
C  4.005134 2.339341 -0.723125
C  3.921252 -2.03369 0.684305
C  -1.271843 0.15201 -0.347836
C  -0.459519 0.868881 -1.280108
C  -0.587044 -0.569718 0.679476
C  -2.711469 0.216116 -0.518592
C  -3.749522 -0.35555 0.197909
C  -5.159914 -0.061601 -0.279713
C  -3.590228 -1.194571 1.343897
H  4.855758 0.374887 -1.096542
H  3.436804 0.731986 -2.091188
H  4.708357 -0.066966 1.16811
H  3.17335 -0.431773 1.968886
H  1.496255 1.456819 -1.943521
H  1.273256 -1.154656 1.567114
H  3.042424 2.870896 -0.718119
H  4.534583 2.494838 0.2291
H  2.9697 -2.571998 0.564933
H  4.560579 -2.184468 -0.198704
H  -0.949005 1.435931 -2.081204
H  -1.152589 -1.141168 1.420368
H  -3.073163 0.823086 -1.363711
H  -6.000865 -1.23492 1.261868
H  -7.13838 -0.465626 0.158125
