program: Gaussian 09
title: 000255833
version: EM64L-G09RevD.01
frameworkgroup: C1[X(C13H12N2O5)]
method: RPBEPBE
basis: SDD
operation: Freq
keyword: #p
keyword: freq=noraman
keyword: PBEPBE/SDD
title: #p freq=noraman PBEPBE/SDD
converged: YES YES NO NO
title: Mulliken charges:
elementType: O O O O O N N C C C C C C C C C C C C C H H H H H H H H H H H H
charge: -0.215709 -0.241748 -0.194124 -0.258109 -0.234160 -0.429773 0.027561 -0.554129 0.166520 -0.302006 0.569185 -0.360460 0.162037 -0.589923 0.339385 0.173566 -0.398691 -0.341781 0.216717 -0.784900 0.247129 0.253390 0.231964 0.236163 0.224411 0.284614 0.327444 0.323312 0.361135 0.246349 0.267320 0.247310
chargesum: 0.00000
title: Mulliken charges with hydrogens summed into heavy atoms:
elementType: O O O O O N N C C C C C C C C C C C C C
charge: -0.215709 -0.241748 -0.194124 -0.258109 -0.234160 -0.068638 0.027561 -0.053610 0.166520 0.166121 0.569185 -0.136049 0.162037 -0.305309 0.339385 0.173566 -0.071247 -0.018469 0.216717 -0.023920
polarizability: 3.57650370e+02 -6.09382343e+00 2.04880751e+02 7.67318177e-01 6.92714907e-01 8.03918311e+01
1716.lowfreq: -46.3284 -0.0008 -0.0008 -0.0007 2.6911 2.9817 6.4771 35.8500 37.0322
frequency: -46.3248 35.8453 37.0223 53.5583 72.7770 82.2320 94.2001 134.9730 153.2676 158.9304 170.2265 184.0424 232.8811 245.6562 276.0357 330.9186 347.5350 360.5132 396.8832 421.6076 441.1394 477.0935 517.4529 557.5706 562.8931 590.4596 641.4432 651.2274 654.2864 681.7684 692.5089 722.5669 730.3634 737.6996 771.6377 821.0521 840.4328 894.6892 899.3115 904.9202 911.4941 934.5933 936.0031 957.3876 987.1750 997.3326 1023.2725 1036.0483 1047.9112 1055.8451 1069.6964 1152.1636 1157.2719 1168.8803 1174.7133 1195.9673 1224.6092 1235.7390 1261.0637 1286.7939 1315.9538 1338.6840 1342.2655 1352.8317 1380.8745 1406.9888 1436.0495 1448.2593 1456.5917 1463.5885 1485.9551 1487.0572 1514.7038 1566.5119 1613.5253 1638.0049 1644.0298 1661.0951 2992.6703 2993.5789 3025.5339 3069.5069 3072.7585 3077.4907 3113.7023 3140.0039 3145.9420 3160.9203 3193.4166 3264.1130
redmass: 1.0479 5.4703 5.2674 11.0659 3.6479 6.6335 5.5467 4.0797 5.4287 5.0656 3.6764 9.6681 4.8507 4.5299 9.1694 5.4022 4.9185 7.3947 3.4552 6.0822 3.8923 7.2295 5.6201 5.7297 3.7146 3.0161 7.3341 4.5769 4.0389 7.9513 7.2393 7.1931 6.4184 4.3250 8.5988 4.5555 1.7409 1.1678 1.2878 4.9309 1.3626 3.9222 4.9631 1.5999 1.7487 3.6613 5.1998 1.6833 1.3131 1.6382 3.0956 3.6358 3.8429 1.2045 1.8622 1.3074 2.7484 1.9596 1.9901 1.4952 3.0817 1.4062 2.9196 3.0533 1.2343 1.6314 3.8985 1.1851 1.0882 1.0461 2.4647 1.1603 3.0113 3.0154 6.0229 6.4664 5.7859 9.4530 1.0383 1.0648 1.0637 1.0922 1.0923 1.0979 1.1063 1.0988 1.0948 1.0913 1.0942 1.0797
irintensity: 0.9260 0.4179 6.9372 5.8848 0.4066 1.8442 5.5660 0.6480 20.3515 0.1307 3.9476 2.4419 2.3396 0.6097 0.4257 0.4564 0.9339 0.3419 0.0379 3.2951 0.6496 4.7691 10.2320 4.1276 14.8013 2.3410 10.1653 6.7375 11.3495 8.9850 2.5134 6.1675 6.4294 11.7557 1.9876 0.4923 16.7989 104.2464 2.0098 34.6744 11.0261 25.4655 1.8789 42.0353 59.9880 190.4839 287.3420 12.7050 0.0918 13.1993 5.0276 229.7581 231.0374 0.2307 80.1148 14.3708 280.2868 66.9364 22.9005 7.9499 79.0908 57.5430 352.3243 105.9177 71.6037 135.7202 37.5928 19.9245 11.8675 20.0286 19.1279 1.8911 411.2572 275.3483 148.7002 209.5453 8.0130 141.5824 2.4682 16.8108 64.5402 4.0651 30.8447 9.4982 27.5025 9.1813 58.2955 3.3572 8.3224 117.2940
temp: 298.150 k
press: 1.00000 atm
elementType: 8 8 8 8 8 7 7 6 6 6 6 6 6 6 6 6 6 6 6 6 1 1 1 1 1 1 1 1 1 1 1 1
symmnumber: 1
zpe: 617250.3 jmol-1
zpe.correction: 0.235098 hartree
zpe.thermalcorrener: 0.252338 hartree
zpe.thermalcorrenthalpy: 0.253282 hartree
zpe.thermalcorrgfe: 0.188342 hartree
zpe.sumelectzpe: -986.699121 hartree
zpe.sumelectthermal: -986.681882 hartree
zpe.sumelectthermalent: -986.680937 hartree
zpe.sumelectthermalfe: -986.745877 hartree
dipole: -1.7777 3.6304 0.2451
dipole: 4.0497
quadrupole: -88.6412 -141.7709 -114.2862
quadrupole: -27.7494 -0.9373 -0.6734
quadrupole: 26.2582 -26.8715 0.6132 -27.7494 -0.9373 -0.6734
hfenergy: -986.9342194 hartree
pointgroup: C01 [X(C13H12N2O5)]
dipole: -0.8604902 -1.2996227 0.3302427 debye
polarizability: 356.1030514|-15.2926212|196.4470554|-12.5235903|-32.2465001|90.3728459 unknown
InChI: InChI=1S/C13H12N2O5/c1-8(16)14-11-3-2-9(7-12(11)15(18)19)6-10-4-5-20-13(10)17/h2-3,6-7,14H,4-5H2,1H3
charge 0 multiplicity 1
32 atoms
O  -5.002013 1.981328 -0.249659
O  -2.789472 2.64578 -0.270484
O  1.584517 -3.42191 1.059161
O  3.497328 -2.296512 0.580496
O  3.648154 2.488502 -0.75555
N  3.387436 0.232944 -0.110014
N  2.190866 -2.341514 0.707891
C  -4.833575 -0.228052 0.71175
C  -3.444293 0.323993 0.405214
C  -5.773867 0.716008 -0.073559
C  -0.86732 -0.161501 0.374153
C  -2.299816 -0.42037 0.569999
C  -3.618128 1.73469 -0.061586
C  0.005494 -1.25182 0.600152
C  2.002243 0.121328 0.044616
C  1.403108 -1.13014 0.443084
C  -0.272764 1.084749 -0.017102
C  1.110853 1.216427 -0.174792
C  4.146777 1.36081 -0.489864
C  5.642288 1.074063 -0.548197
H  -4.956704 -1.281932 0.41111
H  -5.039562 -0.159261 1.797251
H  -6.014002 0.331082 -1.08035
H  -6.70041 0.977313 0.458803
H  -2.490711 -1.447675 0.920315
H  -0.382082 -2.22927 0.903544
H  -0.918721 1.95114 -0.18775
H  1.544212 2.172938 -0.471148
H  3.88798 -0.653589 0.09052
H  6.020132 0.728259 0.431453
H  6.169639 1.995572 -0.832145
H  5.866011 0.287017 -1.29171
