program: Gaussian 09
title: 000255822
version: EM64L-G09RevD.01
frameworkgroup: C1[X(C13H15NO5)]
method: RPBEPBE
basis: SDD
operation: Freq
keyword: #p
keyword: freq=noraman
keyword: PBEPBE/SDD
title: #p freq=noraman PBEPBE/SDD
converged: YES YES NO NO
title: Mulliken charges:
elementType: O O O O O N C C C C C C C C C C C C C H H H H H H H H H H H H H H H
charge: -0.290156 -0.269744 -0.269792 -0.310784 -0.265836 -0.459143 -0.138238 -0.145315 -0.042268 -0.015903 -0.356084 -0.501410 0.263703 0.477008 -0.440948 -0.355581 -0.195143 -0.209592 -0.255788 0.263044 0.267297 0.270108 0.234088 0.262115 0.262482 0.234957 0.240940 0.206764 0.331941 0.223531 0.298327 0.227760 0.227591 0.230072
chargesum: 0.00000
title: Mulliken charges with hydrogens summed into heavy atoms:
elementType: O O O O O N C C C C C C C C C C C C C
charge: -0.290156 -0.269744 -0.269792 -0.310784 -0.265836 -0.127202 0.124806 0.121982 0.227840 0.218185 0.168513 0.181250 0.263703 0.477008 -0.217417 -0.057255 0.032617 0.017999 -0.025716
polarizability: 2.39665815e+02 9.51911418e-01 1.53598254e+02 -2.04960428e+01 4.64410764e+00 9.97556786e+01
1716.lowfreq: -8.4672 -5.4633 -0.0007 -0.0005 0.0005 5.0552 19.5537 21.5970 26.8685
frequency: 19.0151 20.7650 26.4301 64.5530 74.6478 85.2046 104.5379 119.5934 153.6315 166.6993 197.0778 219.2919 248.4529 269.0605 297.0942 339.4454 346.6403 389.8769 407.9480 431.6811 508.3160 509.3466 556.7673 608.6012 618.1109 644.7648 657.8717 674.5426 695.5674 699.7112 749.0468 766.6964 767.3740 815.6298 828.2005 841.7464 850.6275 857.0409 893.1830 897.1245 914.2477 952.3160 970.9007 972.3274 984.6828 996.4560 1005.7331 1012.2906 1031.3694 1038.1698 1057.8886 1070.2310 1090.1991 1115.1565 1118.4344 1147.5126 1161.1449 1173.2425 1180.2909 1190.0809 1233.5693 1250.7899 1257.6969 1259.1822 1291.9173 1316.6094 1325.7218 1346.1975 1358.8990 1370.0282 1386.4907 1431.0250 1433.9182 1449.0535 1456.3862 1479.6132 1485.7956 1517.3256 1601.6536 1617.4267 1669.9790 2958.4383 3007.9495 3018.0852 3050.4301 3059.3392 3114.8798 3123.2064 3133.5388 3138.6697 3145.7691 3163.5539 3166.1862 3180.6382 3189.3480 3539.8720
redmass: 4.7920 4.3224 6.1461 7.3798 5.5307 5.1383 2.9917 4.6814 3.8852 1.3388 4.6683 4.1814 4.3690 5.6040 3.2131 6.4917 5.4630 7.2935 2.9199 4.9658 4.5533 2.9196 4.2546 6.1800 6.3043 1.3634 5.1547 7.0747 2.3249 3.7014 5.6839 1.7566 5.3631 2.9616 5.7110 1.2638 3.5781 3.3207 5.7876 6.8069 1.4314 2.8135 2.6144 1.3591 6.1589 1.3060 1.9479 4.3674 2.3420 2.2789 2.3036 1.6676 1.5591 1.2737 2.6793 1.3780 3.5255 1.0519 1.3153 1.1135 1.2071 1.2165 1.9821 1.3453 1.3428 1.5908 1.3923 1.4769 1.5143 2.8079 7.0416 1.1476 2.2887 1.1020 1.0504 1.0523 2.2299 2.2240 5.2569 6.0423 8.6205 1.0358 1.0863 1.0849 1.0587 1.0983 1.0884 1.1018 1.0869 1.1080 1.0935 1.0890 1.0996 1.0992 1.0954 1.0760
irintensity: 0.7856 1.7162 0.1164 3.1852 2.0190 1.4778 2.1071 2.4500 0.4551 0.7330 2.8861 27.9846 0.9266 7.2168 21.4260 4.5235 8.9885 6.1679 0.0055 13.6957 1.7196 31.8349 6.9598 0.3344 4.1560 25.9756 2.5091 23.3702 6.2530 85.0533 8.2791 125.0801 28.5871 31.9093 6.0934 0.5369 11.4402 63.9394 60.4263 10.2999 14.7316 45.9886 199.2622 0.6620 1.6777 2.1030 17.9788 283.7044 58.7369 64.0314 52.1236 18.0603 32.1873 1.4917 15.4121 8.1434 366.1627 1.0508 12.1838 6.6675 20.1768 0.4393 6.7858 2.5244 0.0956 27.1236 49.5289 4.2941 0.6771 8.4487 45.5248 9.2183 105.7419 29.0337 10.7159 11.9274 16.4208 530.7441 29.9987 99.2623 239.4525 70.1969 49.5094 19.7746 17.8785 39.3536 13.4315 22.9346 0.6750 2.7948 29.8963 6.8399 22.4372 10.2384 5.9420 31.7556
temp: 298.150 k
press: 1.00000 atm
elementType: 8 8 8 8 8 7 6 6 6 6 6 6 6 6 6 6 6 6 6 1 1 1 1 1 1 1 1 1 1 1 1 1 1 1
symmnumber: 1
zpe: 694634.2 jmol-1
zpe.correction: 0.264572 hartree
zpe.thermalcorrener: 0.282276 hartree
zpe.thermalcorrenthalpy: 0.283220 hartree
zpe.thermalcorrgfe: 0.215621 hartree
zpe.sumelectzpe: -933.780228 hartree
zpe.sumelectthermal: -933.762524 hartree
zpe.sumelectthermalent: -933.761580 hartree
zpe.sumelectthermalfe: -933.829179 hartree
dipole: 0.2573 -0.4613 -1.3884
dipole: 1.4855
quadrupole: -90.8458 -108.1575 -113.2282
quadrupole: -11.3968 -2.9463 2.1785
quadrupole: 13.2314 -4.0803 -9.1510 -11.3968 -2.9463 2.1785
hfenergy: -934.0447999 hartree
pointgroup: C01 [X(C13H15N1O5)]
dipole: -0.09977 -0.1769954 0.5479953 debye
polarizability: 239.7652245|0.1025301|153.4747464|-20.117199|-5.529747|99.7797763 unknown
InChI: InChI=1S/C13H15NO5/c1-16-12-11-10(19-11)9(18-12)7-17-13(15)14-8-5-3-2-4-6-8/h2-6,9-12,14H,7H2,1H3
charge 0 multiplicity 1
34 atoms
O  3.5058 -2.138422 0.171934
O  3.429002 0.482453 -0.789688
O  4.910751 1.219672 1.000593
O  0.025683 -1.070041 -0.856463
O  -0.852177 1.121977 -0.914167
N  -2.137073 -0.775951 -0.289431
C  2.613347 -1.090589 0.817745
C  4.097608 -0.998157 0.962669
C  2.164453 -0.027833 -0.175722
C  4.569843 0.152601 0.085052
C  1.323678 -0.550343 -1.34898
C  5.412682 2.424566 0.319158
C  -0.999861 -0.106515 -0.700799
C  -3.417719 -0.226605 0.002231
C  -4.428699 -1.127536 0.431833
C  -3.709127 1.157336 -0.121701
C  -5.719744 -0.650584 0.735153
C  -5.007582 1.617383 0.186892
C  -6.018638 0.72672 0.614773
H  1.947346 -1.454714 1.603403
H  4.655969 -1.258044 1.864845
H  1.639241 0.794675 0.346789
H  5.408083 -0.075093 -0.603046
H  1.819846 -1.411986 -1.818878
H  1.150354 0.258903 -2.07752
H  5.653966 3.14084 1.118717
H  4.640881 2.844933 -0.350371
H  6.326031 2.194699 -0.267105
H  -2.028315 -1.788562 -0.197144
H  -4.204086 -2.197665 0.527357
H  -2.930018 1.846541 -0.453698
H  -6.490813 -1.355405 1.065107
H  -5.22796 2.686299 0.08903
H  -7.02175 1.097544 0.849733
