program: Gaussian 09
title: 000018296
version: EM64L-G09RevD.01
frameworkgroup: C1[X(C22H23N2S2)]
method: RPBEPBE
basis: SDD
operation: Freq
keyword: #p
keyword: freq=noraman
keyword: PBEPBE/SDD
title: #p freq=noraman PBEPBE/SDD
converged: YES YES NO NO
title: Mulliken charges:
elementType: S S N N C C C C C C C C C C C C C C C C C C C C C C H H H H H H H H H H H H H H H H H H H H H H H
charge: 0.258603 0.211954 -0.209902 -0.206368 0.611312 0.605722 -0.063790 -0.008121 -0.399850 -0.402532 -0.340621 -0.337121 0.446284 -0.267553 -0.347168 -0.341819 -0.338960 -0.274130 -0.274708 -0.647223 -0.648062 -0.807944 -0.214413 -0.214425 -0.229922 -0.230858 0.245534 0.242823 0.247071 0.247232 0.221211 0.232824 0.252950 0.256488 0.262523 0.258480 0.237690 0.241338 0.243412 0.246218 0.236037 0.243042 0.252713 0.238866 0.251064 0.251370 0.252187 0.255541 0.255003
chargesum: 1.00000
title: Mulliken charges with hydrogens summed into heavy atoms:
elementType: S S N N C C C C C C C C C C C C C C C C C C C C C C
charge: 0.258603 0.211954 -0.209902 -0.206368 0.611312 0.605722 -0.063790 -0.008121 0.088507 0.091771 -0.340621 -0.337121 0.446284 -0.046342 -0.114344 -0.088869 -0.082473 -0.011608 -0.016228 0.075218 0.077234 -0.065300 0.036957 0.037761 0.025618 0.024144
polarizability: 7.32853341e+02 -1.20413460e+01 3.11312463e+02 9.17334992e+00 1.00825923e+01 1.32949160e+02
1716.lowfreq: -8.0871 -2.4915 -1.7385 -0.0010 0.0008 0.0012 8.3165 18.3476 38.4593
frequency: 7.9195 18.1960 38.4386 54.5773 57.2403 66.0310 73.2367 84.8509 91.3213 123.0905 151.7812 159.0818 177.2174 188.8893 203.9119 212.0830 224.4783 236.5677 256.3709 276.9610 285.7995 307.7566 322.2305 353.9176 390.7071 401.1433 410.8239 414.2168 433.3791 437.1953 449.9118 492.0921 496.3205 518.5354 523.3737 528.1579 531.7194 551.1776 588.5535 598.4307 607.3360 623.6657 663.0057 684.5738 688.9630 698.1202 721.2569 724.0349 760.2277 760.8803 766.8647 773.0049 798.5833 805.6626 811.5940 829.6231 853.3091 856.0051 906.7012 930.9628 945.6395 947.4503 947.7559 993.1248 993.7260 1017.3034 1025.0449 1025.5032 1028.4080 1032.4082 1033.6669 1051.2934 1053.4145 1087.2234 1088.0874 1134.8847 1136.3182 1140.0029 1141.5133 1182.3458 1182.8194 1210.5209 1225.1451 1254.4755 1268.8708 1275.9790 1287.3831 1303.8876 1311.1364 1337.7730 1342.8770 1344.8582 1354.2731 1392.9353 1398.4832 1399.2189 1399.9310 1400.4840 1402.9635 1433.5661 1449.8645 1452.2357 1456.4260 1456.8141 1468.2405 1469.3486 1470.6231 1481.9390 1483.4753 1485.4783 1511.2123 1512.4329 1549.8420 1571.2859 1593.0412 1594.9453 1598.0627 1598.9792 2976.6046 2998.5289 2999.2029 3036.8338 3037.9455 3053.2348 3080.6307 3082.2155 3099.2071 3100.3393 3101.5836 3106.4924 3107.2505 3143.7134 3152.9760 3153.0479 3155.7070 3161.2910 3161.8283 3171.4715 3171.8365 3184.9604 3185.0156
redmass: 4.4784 4.8771 5.1946 3.3953 4.6880 4.1086 3.0674 3.6588 3.6161 5.6385 5.2364 4.3266 4.8590 4.4426 1.0724 1.1174 2.6638 1.2255 4.2737 3.7071 4.2368 3.1055 3.3191 3.7492 4.4593 4.4070 4.2355 4.9255 3.3883 3.5097 5.2993 7.9816 7.6730 4.2317 3.6508 4.1327 4.2738 2.4500 4.9422 4.5393 4.5783 5.5448 4.5437 6.0177 5.6164 5.5610 3.3310 3.3759 1.3770 1.3726 2.5229 1.6016 1.4047 1.5574 1.5463 2.0930 1.3637 1.3575 3.1607 2.6503 1.3830 1.5053 2.4018 1.3358 1.3360 1.9753 2.7554 2.9133 4.0490 3.1827 1.6226 2.5937 3.0068 1.9436 1.9451 1.8610 1.8532 1.4842 1.4900 1.0923 1.0895 2.5731 1.9944 1.7924 1.7724 1.4281 1.9161 2.6815 2.1839 1.5336 1.3181 1.5323 1.5603 2.1104 1.2722 1.7996 2.1161 2.9351 1.9772 2.5557 2.4577 2.3217 2.6656 2.5053 1.0487 1.0511 1.0583 1.1044 1.1619 1.0976 1.0882 1.1123 4.0874 5.7284 6.8173 6.8196 6.9010 7.1151 1.0394 1.0362 1.0362 1.0613 1.0611 1.0968 1.1024 1.1022 1.0974 1.0997 1.0998 1.1028 1.1028 1.0861 1.0868 1.0868 1.0854 1.0903 1.0903 1.0957 1.0956 1.1008 1.1008
irintensity: 0.8616 0.3181 0.2296 0.0474 0.3963 0.3916 0.2600 1.1605 0.6117 0.3104 0.9131 0.0356 0.1058 0.7253 0.2781 0.0624 1.2568 1.5512 1.9517 2.3950 0.7228 0.8542 0.2547 0.0915 8.6042 4.1420 2.2483 0.6134 10.3247 3.9038 2.8039 20.6308 6.7703 5.6442 1.5588 2.9416 5.4480 11.1882 2.3872 2.7391 4.4613 0.2049 4.5944 7.7474 18.5886 8.1731 6.6160 5.9453 67.5557 121.1953 4.5440 74.9283 8.8733 10.0952 36.6681 45.8308 0.5347 0.3721 1.0944 8.2065 0.7683 1.1127 2.0648 0.0595 0.0556 10.5349 22.3392 0.7354 21.9804 1.1485 12.8369 3.5194 1.0392 34.5541 1.6654 21.7463 22.9560 25.6845 3.5766 10.8240 12.6726 100.5164 39.5504 21.8281 7.2359 35.7268 0.5940 122.2816 70.8726 12.5068 0.8860 202.3408 180.0883 344.2240 24.4351 20.3702 76.5065 55.2749 91.5015 18.7054 3.7557 4.3021 38.4204 117.9899 16.2567 8.0769 22.8008 100.2142 243.9309 67.5433 16.6541 123.2379 2395.7443 212.7512 57.9606 27.9780 12.1580 8.4813 1.4032 8.8435 11.2486 17.5228 23.8785 4.6734 0.0895 0.6565 18.2874 15.7729 26.3514 17.4868 17.1493 6.9611 1.0819 1.5350 2.4883 1.4896 1.2754 5.7157 5.2050 15.9519 4.9780
temp: 298.150 k
press: 1.00000 atm
elementType: 16 16 7 7 6 6 6 6 6 6 6 6 6 6 6 6 6 6 6 6 6 6 6 6 6 6 1 1 1 1 1 1 1 1 1 1 1 1 1 1 1 1 1 1 1 1 1 1 1
symmnumber: 1
zpe: 1035732.3 jmol-1
zpe.correction: 0.394490 hartree
zpe.thermalcorrener: 0.419180 hartree
zpe.thermalcorrenthalpy: 0.420125 hartree
zpe.thermalcorrgfe: 0.337630 hartree
zpe.sumelectzpe: -1755.711175 hartree
zpe.sumelectthermal: -1755.686484 hartree
zpe.sumelectthermalent: -1755.685540 hartree
zpe.sumelectthermalfe: -1755.768035 hartree
dipole: 1.5191 -0.1921 0.5972
dipole: 1.6436
quadrupole: -46.9017 -124.6001 -172.4814
quadrupole: 9.8677 3.1400 2.9796
quadrupole: 67.7594 -9.9391 -57.8203 9.8677 3.1400 2.9796
hfenergy: -1756.1056645 hartree
pointgroup: C01 [X(C22H23N2S2)]
dipole: 0.6001958 -0.2394854 0.0234024 debye
polarizability: 729.1996565|-10.7228045|180.318655|-40.6330158|80.4350294|267.5966522 unknown
InChI: InChI=1S/C22H23N2S2/c1-4-23-17-10-6-8-12-19(17)25-21(23)14-16(3)15-22-24(5-2)18-11-7-9-13-20(18)26-22/h6-15H,4-5H2,1-3H3
charge 1 multiplicity 1
49 atoms
S  -3.428456 1.619938 1.455464
S  1.748286 0.1462 -1.343936
N  -3.039478 0.037792 -0.627334
N  3.63008 0.687654 0.430776
C  -4.450714 0.148391 -0.528052
C  4.342239 0.246955 -0.714042
C  -2.307852 0.711742 0.343075
C  2.247837 0.74937 0.301217
C  -2.405768 -0.776582 -1.700698
C  4.344364 1.087118 1.675063
C  -4.863337 0.985612 0.539677
C  3.492844 -0.114066 -1.790927
C  -0.039655 1.330591 1.351785
C  -0.900391 0.678959 0.428328
C  1.383504 1.266511 1.28617
C  -5.418321 -0.465346 -1.356683
C  5.744805 0.137389 -0.85765
C  -6.217756 1.244211 0.805134
C  3.994612 -0.595466 -3.010083
C  -2.162074 -2.237889 -1.274076
C  4.73719 2.578093 1.683394
C  -0.601096 2.146335 2.504931
C  -6.780817 -0.211133 -1.095614
C  6.257425 -0.345539 -2.079696
C  -7.18155 0.634601 -0.030117
C  5.397476 -0.711038 -3.146064
H  -3.071443 -0.730215 -2.578469
H  -1.466552 -0.283396 -2.001776
H  3.702249 0.835873 2.535354
H  5.237353 0.444893 1.757502
H  -0.428827 0.016002 -0.301511
H  1.896107 1.735626 2.132123
H  -5.13422 -1.128916 -2.177822
H  6.427022 0.424263 -0.052882
H  -6.523079 1.893937 1.630257
H  3.329132 -0.871169 -3.833105
H  -1.477666 -2.300738 -0.410679
H  -1.710958 -2.799131 -2.110963
H  -3.107161 -2.736546 -0.998871
H  5.265379 2.81721 2.622839
H  3.85121 3.232265 1.611288
H  5.409035 2.821262 0.842529
H  -1.166148 3.024745 2.137573
H  0.200586 2.525926 3.158058
H  -1.290567 1.551343 3.132645
H  -7.541233 -0.679803 -1.727673
H  7.340775 -0.434785 -2.205161
H  -8.244859 0.815941 0.151863
H  5.819468 -1.081989 -4.08466
