program: Gaussian 09
title: 000255814
version: EM64L-G09RevD.01
frameworkgroup: C1[X(C9H17BrN2O)]
method: RPBEPBE
basis: SDD
operation: Freq
keyword: #p
keyword: freq=noraman
keyword: PBEPBE/SDD
title: #p freq=noraman PBEPBE/SDD
converged: YES YES NO NO
title: Mulliken charges:
elementType: Br O N N C C C C C C C C C H H H H H H H H H H H H H H H H H
charge: -0.028056 -0.315575 -0.437061 -0.408047 -0.042871 -0.433213 -0.405534 -0.409950 -0.409124 -0.378209 0.331404 -0.316989 -0.643405 0.262081 0.219692 0.198369 0.193371 0.226835 0.174449 0.209771 0.204717 0.193624 0.195547 0.200735 0.279706 0.282419 0.287349 0.223953 0.264103 0.279911
chargesum: 0.00000
title: Mulliken charges with hydrogens summed into heavy atoms:
elementType: Br O N N C C C C C C C C C
charge: -0.028056 -0.315575 -0.157356 -0.125628 0.219210 -0.015152 0.014671 -0.025731 -0.010783 0.018073 0.331404 0.194313 -0.099392
polarizability: 1.46612196e+02 -5.78019204e+00 1.23495564e+02 1.91091819e+00 -6.28319117e+00 1.07916006e+02
1716.lowfreq: -29.0340 -4.3987 -0.0005 -0.0004 -0.0003 3.4262 4.4645 22.6387 41.9872
frequency: -25.4377 21.1615 41.9307 64.2321 81.2239 137.1304 165.8004 216.8157 220.1612 253.8979 278.4884 307.4252 359.8963 385.2643 413.6337 461.6705 464.9821 489.8725 510.7986 539.7572 621.8848 707.6430 710.8253 776.5887 797.3536 827.0466 840.8845 861.8063 868.0660 914.7605 926.5657 956.3169 1003.5175 1016.6535 1025.0632 1045.5460 1055.4126 1088.1851 1115.2054 1135.0255 1150.6745 1154.0441 1193.2469 1213.8008 1226.1563 1242.3273 1259.8002 1271.5900 1277.4397 1304.4643 1321.3360 1330.3195 1336.7026 1346.3689 1353.5193 1356.4565 1368.9101 1440.7672 1455.2673 1458.5142 1461.9721 1464.4521 1471.8344 1473.6028 1482.6228 1501.5142 1633.3386 2922.9752 2947.6790 2966.1291 2968.4025 2976.3108 2983.4447 3025.1326 3028.5786 3036.0518 3040.4463 3041.8112 3045.5769 3051.5321 3069.7119 3125.1761 3546.4722 3554.4762
redmass: 4.2516 7.3776 5.6048 5.3147 3.3264 2.8972 4.2434 2.3367 2.9199 2.2776 1.2644 2.9177 2.0296 2.5473 2.6546 2.6592 2.3235 2.3879 1.4739 3.2238 2.5201 4.5533 10.0557 1.4925 3.1538 1.8709 1.5592 2.4700 2.1014 2.0407 1.4266 2.5432 2.1601 1.9716 2.3612 1.4608 1.8713 1.7913 1.0544 2.1136 1.7606 1.6314 1.9744 1.2146 1.7326 1.3641 1.2699 1.2911 1.1586 1.6373 1.4582 1.3517 1.4199 1.4073 1.4161 1.4158 1.3588 1.1469 1.3210 1.1874 1.0900 1.1061 1.0842 1.0897 1.1747 2.0361 5.1490 1.0704 1.0678 1.0650 1.0612 1.0633 1.0620 1.0927 1.0955 1.0998 1.0597 1.0872 1.1010 1.1011 1.0884 1.1090 1.0773 1.0766
irintensity: 1.3553 0.3965 10.9575 6.3166 2.8236 0.9303 2.1561 4.6509 4.9468 1.2450 0.7408 18.3137 5.1867 1.6647 0.3673 12.0191 11.6679 7.1646 213.4321 4.6221 3.1059 0.5458 11.1030 0.8529 5.1288 6.3761 0.2535 8.0939 13.1569 11.8417 4.9002 18.7249 3.5990 6.3272 0.9079 0.8702 1.2600 0.7771 1.5953 24.6710 6.9633 2.6313 2.1066 82.5989 168.5821 34.1571 9.6247 17.7326 43.7224 17.8920 17.4948 1.3905 0.5414 0.6663 0.7047 8.0551 5.2214 19.4152 71.3533 25.6983 6.4059 45.4352 13.2837 12.2053 49.8778 530.7173 189.5796 64.4487 37.8199 29.7428 36.9376 23.3882 30.6038 74.2081 70.5718 34.5840 39.3688 18.8125 32.2359 81.8852 2.4617 14.4577 12.9942 8.8448
temp: 298.150 k
press: 1.00000 atm
elementType: 35 8 7 7 6 6 6 6 6 6 6 6 6 1 1 1 1 1 1 1 1 1 1 1 1 1 1 1 1 1
symmnumber: 1
zpe: 673434.4 jmol-1
zpe.correction: 0.256498 hartree
zpe.thermalcorrener: 0.269905 hartree
zpe.thermalcorrenthalpy: 0.270850 hartree
zpe.thermalcorrgfe: 0.214042 hartree
zpe.sumelectzpe: -550.325057 hartree
zpe.sumelectthermal: -550.311649 hartree
zpe.sumelectthermalent: -550.310705 hartree
zpe.sumelectthermalfe: -550.367513 hartree
dipole: 1.5325 -0.0368 -4.5152
dipole: 4.7683
quadrupole: -83.3560 -90.5240 -88.4074
quadrupole: -9.7121 5.9586 -5.6531
quadrupole: 4.0732 -3.0949 -0.9783 -9.7121 5.9586 -5.6531
hfenergy: -550.5815549 hartree
pointgroup: C01[X(C9H17Br1N2O1)]
dipole: -0.3000955 -1.4629132 1.1354244 debye
polarizability: 147.6263594|4.9021234|107.6896505|0.3652649|4.9553724|122.7077562 unknown
InChI: InChI=1S/C9H17BrN2O/c10-6-7-11-9(13)12-8-4-2-1-3-5-8/h8,11-12H,1-7H2
charge 0 multiplicity 1
30 atoms
Br 4.178154 -0.255355 -2.07574
O  0.940859 2.032415 -0.223031
N  -0.240592 0.016152 -0.07696
N  2.037327 0.096227 0.512618
C  -1.521481 0.600356 -0.531822
C  -2.252875 -0.383448 -1.480207
C  -2.43784 0.991749 0.66139
C  -2.809667 -1.623691 -0.735636
C  -2.987301 -0.245017 1.410772
C  -3.720709 -1.208917 0.445629
C  0.907183 0.791461 0.049918
C  3.336676 0.753399 0.589161
C  4.475021 -0.022457 -0.081095
H  -1.246614 1.518107 -1.081948
H  -1.572249 -0.686853 -2.298259
H  -3.100261 0.158491 -1.945289
H  -3.28597 1.585871 0.262985
H  -1.873683 1.651146 1.346395
H  -1.976174 -2.251255 -0.351161
H  -3.367233 -2.264748 -1.44515
H  -3.669302 0.076941 2.22101
H  -2.14777 -0.78049 1.901452
H  -4.622447 -0.702169 0.043552
H  -4.073958 -2.105676 0.990832
H  -0.206111 -0.987507 0.104158
H  1.9709 -0.893455 0.753023
H  3.208358 1.750016 0.133008
H  3.64584 0.913975 1.647688
H  4.58658 -1.049278 0.30503
H  5.429538 0.519212 0.011177
