program: Gaussian 09
title: 000255929
version: EM64L-G09RevD.01
frameworkgroup: C1[X(C18H27NO5S2)]
method: RPBEPBE
basis: SDD
operation: Freq
keyword: #p
keyword: freq=noraman
keyword: PBEPBE/SDD
title: #p freq=noraman PBEPBE/SDD
converged: YES YES NO NO
title: Mulliken charges:
elementType: S S O O O O O N C C C C C C C C C C C C C C C C C C H H H H H H H H H H H H H H H H H H H H H H H H H H H
charge: 0.201222 0.180413 -0.478796 -0.500379 -0.268232 -0.336842 -0.312082 -0.359518 0.014914 -0.091863 -0.043365 -0.948797 -0.399101 0.286498 -0.563524 -0.573645 -0.771871 -0.658266 -0.652051 0.252412 0.207015 -0.337346 -0.335009 -0.218862 -0.215788 -0.219431 0.307428 0.215724 0.219208 0.401852 0.315575 0.268870 0.254962 0.375606 0.385010 0.253758 0.272367 0.274771 0.255868 0.224114 0.256090 0.252951 0.232428 0.226351 0.223184 0.223888 0.229857 0.223275 0.271865 0.272287 0.235806 0.234346 0.234852
chargesum: 0.00000
title: Mulliken charges with hydrogens summed into heavy atoms:
elementType: S S O O O O O N C C C C C C C C C C C C C C C C C C
charge: 0.201222 0.180413 -0.103190 -0.115369 -0.268232 -0.336842 -0.312082 -0.043943 0.322342 0.123862 0.175843 -0.546945 0.124730 0.286498 -0.037399 -0.043006 -0.038716 0.023698 0.024968 0.252412 0.207015 -0.065481 -0.062722 0.016944 0.018558 0.015421
polarizability: 3.20161196e+02 -2.90035565e+01 2.33369248e+02 2.21477723e+01 1.69429159e+01 2.39773201e+02
1716.lowfreq: -7.4792 -6.1722 -4.6772 0.0004 0.0011 0.0019 11.2416 19.3786 22.1561
frequency: 11.0579 19.3634 21.9944 30.8726 32.9635 34.3530 43.2501 59.4746 61.6538 62.8500 70.5150 74.3089 90.4707 99.5623 117.1724 124.2310 136.8796 147.7627 159.9923 170.2446 186.7703 202.5798 227.4120 239.2946 244.7384 248.4010 255.3972 287.1491 304.8723 313.3086 331.9299 341.0357 362.4804 403.4012 403.5697 439.3902 450.4889 473.5871 495.8437 501.5395 570.3565 595.2869 608.2752 613.5131 617.8927 629.3677 656.5183 660.2410 666.5132 687.4774 696.4392 703.5625 706.5643 740.6955 765.3648 779.1041 790.3478 797.6980 850.7048 866.1511 868.0960 882.2258 908.6317 938.6855 957.7361 960.6311 990.5841 992.3641 996.1722 998.1002 1010.2578 1010.8129 1020.7368 1023.2125 1033.5673 1035.8431 1047.9439 1051.9673 1065.8890 1067.9388 1073.3350 1085.8311 1087.9814 1098.6521 1110.9075 1174.9027 1183.5602 1202.1814 1212.9912 1236.4478 1239.1831 1239.4251 1248.5373 1258.8404 1261.1224 1269.1707 1279.7761 1286.9842 1299.5288 1316.2545 1323.5719 1330.1656 1346.4975 1354.4964 1391.0105 1392.7224 1395.1064 1396.9311 1412.3446 1429.4053 1438.7784 1449.7789 1459.3975 1460.1128 1462.4082 1470.2253 1470.4836 1472.1519 1478.0160 1481.6145 1483.0497 1509.3924 1573.7998 1601.2062 1607.1295 1611.9205 2934.9766 2952.5908 2984.2383 2986.1607 2999.2277 3001.3266 3014.6399 3019.8949 3030.7162 3060.4049 3074.5886 3075.1082 3077.1965 3081.1434 3081.4344 3099.9642 3103.0405 3105.0753 3108.1530 3132.4702 3145.2389 3147.3886 3157.4520 3169.1021 3180.0401 3297.5565 3415.8338
redmass: 4.8542 4.0066 4.5489 3.9334 4.3657 3.3602 3.5120 2.3422 3.5888 2.8469 1.9909 1.6614 5.7135 5.7599 7.1672 6.0173 4.4135 4.3995 4.8978 4.4824 5.4693 4.9482 1.6736 1.2636 2.1359 5.5056 3.2611 6.5143 6.5847 4.5247 4.5308 4.4642 5.8774 3.5423 4.1062 3.5249 4.8132 4.5090 3.6424 4.5389 4.2944 3.5707 4.8195 6.4167 4.4221 4.5909 3.9100 1.5963 1.4029 3.7425 2.6342 3.5790 1.8357 4.4977 4.9928 1.1392 1.1124 2.2107 4.0388 1.2443 1.1391 5.5978 2.7202 3.9671 1.4163 3.4830 6.2288 1.7754 1.7939 1.3862 2.1938 1.3687 2.5571 2.6632 1.2288 1.2254 1.6418 3.2824 2.2679 2.4003 2.3111 3.5074 2.1635 3.1073 3.2608 1.0576 1.1197 1.2163 1.1814 1.1922 1.2260 1.2509 1.2389 1.1920 2.7800 1.2275 1.1945 1.2441 1.5123 1.3148 1.5851 1.3028 1.2281 1.2913 10.0378 1.2336 1.2032 1.2066 1.3343 1.1016 2.2153 1.0510 1.1624 1.2512 1.0987 1.0394 1.0404 1.1514 2.2637 1.0476 1.0478 2.0073 6.9496 7.0629 3.7852 6.1110 1.0819 1.0847 1.0355 1.0355 1.0809 1.0380 1.0576 1.0578 1.0694 1.0602 1.0995 1.1010 1.0909 1.1003 1.0996 1.0979 1.1055 1.1059 1.1014 1.0857 1.0892 1.1065 1.0939 1.0978 1.0981 1.0678 1.0770
irintensity: 0.1567 0.5756 0.1028 1.3785 1.2835 0.4579 3.3129 2.0322 4.4870 0.5157 1.6172 0.0734 2.1277 1.3648 1.0111 2.7796 1.8062 1.6613 5.4414 4.3879 0.2069 4.1708 0.5877 0.5625 0.9141 14.3089 3.0670 7.8407 10.8981 7.9788 5.2581 0.6726 4.7393 1.4325 2.4374 5.2805 22.7537 6.9724 11.2918 1.1750 0.5838 2.7335 5.3665 0.1756 11.9023 13.8148 14.3470 37.6791 62.7912 22.3959 31.4890 55.2681 136.1973 16.9662 1.1529 6.6462 5.9913 16.7200 7.9917 0.0493 135.9276 68.3274 5.1692 0.8910 4.0602 12.5675 1.1892 17.9631 19.5565 0.0570 8.1586 0.1225 48.6731 26.4436 0.6643 1.0008 13.7286 13.8354 29.2824 27.0749 81.5328 21.3009 11.8518 89.6597 44.8925 0.4326 43.2392 30.4312 30.6817 41.2767 1.6262 3.4767 23.5962 46.8528 279.7467 9.4172 13.8465 7.9686 79.8858 2.2599 9.1735 27.0326 47.8172 5.9813 5.4293 64.5146 18.0066 19.5639 294.9711 16.0381 18.1873 12.7147 82.4858 104.5580 13.2406 14.2840 17.7486 14.6053 4.5945 8.3842 7.9759 356.0851 106.9686 48.5680 114.5263 40.2967 6.2217 65.5939 40.2757 32.2593 14.2025 16.4258 14.1027 12.6214 759.8077 6.0975 12.5773 16.1273 6.5182 14.4300 17.9036 6.4653 40.6716 40.8645 18.4117 0.2340 10.2800 6.6429 15.7152 18.2350 10.1596 616.5575 120.6096
temp: 298.150 k
press: 1.00000 atm
elementType: 16 16 8 8 8 8 8 7 6 6 6 6 6 6 6 6 6 6 6 6 6 6 6 6 6 6 1 1 1 1 1 1 1 1 1 1 1 1 1 1 1 1 1 1 1 1 1 1 1 1 1 1 1
symmnumber: 1
zpe: 1121785.7 jmol-1
zpe.correction: 0.427266 hartree
zpe.thermalcorrener: 0.457154 hartree
zpe.thermalcorrenthalpy: 0.458099 hartree
zpe.thermalcorrgfe: 0.360651 hartree
zpe.sumelectzpe: -1927.116172 hartree
zpe.sumelectthermal: -1927.086283 hartree
zpe.sumelectthermalent: -1927.085339 hartree
zpe.sumelectthermalfe: -1927.182787 hartree
dipole: -1.6985 4.0315 -1.4402
dipole: 4.6056
quadrupole: -130.9746 -180.0085 -165.4512
quadrupole: -1.3220 7.8561 6.4343
quadrupole: 27.8368 -21.1970 -6.6398 -1.3220 7.8561 6.4343
hfenergy: -1927.5434376 hartree
pointgroup: C01 [X(C18H27N1O5S2)]
dipole: 0.6079072 -1.6339685 0.4939014 debye
polarizability: 319.54687|-35.8199662|219.7842049|6.2456973|-8.1131876|253.972571 unknown
InChI: InChI=1S/C18H27NO5S2/c1-4-25-18(26-5-2)15(19-12(3)20)16(22)14(21)11-24-17(23)13-9-7-6-8-10-13/h6-10,14-16,18-19,21-22H,4-5,11H2,1-3H3
charge 0 multiplicity 1
53 atoms
S  -2.225508 -2.204141 -1.250112
S  -4.154375 -1.401794 0.997032
O  -1.224589 2.412444 -1.343285
O  -0.335747 0.748445 1.047233
O  2.485164 0.699058 -0.635473
O  -3.492631 2.548618 -2.604317
O  2.29775 0.946599 1.672961
N  -3.812219 0.555122 -1.409661
C  -2.619859 0.514575 -0.519232
C  -1.286052 0.966079 -1.207884
C  -0.044755 0.55149 -0.379106
C  -2.546415 -0.907625 0.080082
C  1.160687 1.384399 -0.854401
C  -4.197208 1.520255 -2.302782
C  -1.552461 -3.580481 -0.120155
C  -4.056412 -0.19429 2.475257
C  -5.554126 1.309365 -2.962465
C  -1.381594 -4.869674 -0.934182
C  -4.923693 -0.721892 3.626711
C  2.976354 0.617542 0.654514
C  4.369386 0.099662 0.716946
C  4.967958 -0.061772 1.994279
C  5.099506 -0.22504 -0.456664
C  6.288083 -0.544637 2.096662
C  6.419674 -0.70929 -0.347671
C  7.015684 -0.869373 0.926341
H  -2.75262 1.223417 0.322902
H  -1.220266 0.464219 -2.199644
H  0.164869 -0.52283 -0.577041
H  -1.735111 -0.927504 0.822607
H  -4.503208 -0.169374 -1.168681
H  1.171955 2.365826 -0.352391
H  1.141486 1.526694 -1.943513
H  -2.04345 2.692161 -1.88348
H  0.536193 0.924518 1.513895
H  -0.592577 -3.230386 0.297678
H  -2.283706 -3.704162 0.696389
H  -2.991989 -0.127732 2.75819
H  -4.397458 0.79701 2.133059
H  -6.061668 0.386216 -2.636416
H  -5.419695 1.277236 -4.057074
H  -6.200157 2.175708 -2.73864
H  -2.347396 -5.211719 -1.345788
H  -0.677916 -4.729083 -1.774262
H  -0.981281 -5.672213 -0.287464
H  -5.981697 -0.821779 3.324152
H  -4.570019 -1.709063 3.971834
H  -4.88115 -0.020997 4.481259
H  4.385358 0.198281 2.884004
H  4.626708 -0.09301 -1.433778
H  6.750207 -0.667324 3.081926
H  6.984928 -0.959856 -1.251671
H  8.042255 -1.244097 1.006622
