program: Gaussian 09
title: 000250466
version: EM64L-G09RevD.01
frameworkgroup: C1[X(C10H18O)]
method: RPBEPBE
basis: SDD
operation: Freq
keyword: #pfreq=noraman
keyword: PBEPBE/SDD
title: #p freq=noraman PBEPBE/SDD
converged: YES YES NO NO
title: Mulliken charges:
elementType: O C C C C C C C C C C H H H H H H H H H H H H H H H H H H
charge: -0.441360 -0.055528 -0.119912 -0.440305 -0.446574 -0.398521 -0.386812 -0.596708 0.572470 -0.829754 -0.759352 0.196407 0.222432 0.225029 0.190163 0.222128 0.179275 0.188186 0.202873 0.196474 0.202753 0.236894 0.207884 0.318804 0.227437 0.224521 0.222003 0.221925 0.217168
chargesum: 0.00000
title: Mulliken charges with hydrogens summed into heavy atoms:
elementType: O C C C C C C C C C C
charge: -0.122555 0.140879 0.102520 -0.025112 -0.045171 -0.007462 0.012415 -0.151930 0.572470 -0.155793 -0.320258
polarizability: 1.24054975e+02 -6.93624181e+00 1.02471526e+02 -5.21887324e+00 7.04807591e+00 9.76199044e+01
1716.lowfreq: -8.2806 -0.0008 -0.0004 0.0004 8.0735 14.8493 27.1407 65.1544 90.9335
frequency: 26.9617 65.0982 90.8906 135.5498 172.3058 185.9292 222.0684 287.5280 318.3355 333.2460 359.0520 394.1027 404.0609 424.5596 440.6263 481.0719 534.8384 556.0739 698.2736 776.6866 808.0129 821.0811 848.1201 876.8472 884.7559 920.4070 937.6500 960.4117 970.5380 998.3743 1004.1388 1036.4012 1052.9103 1060.6733 1067.1903 1092.5347 1110.9936 1129.6910 1174.1697 1199.6564 1203.7477 1250.5982 1257.5109 1284.4837 1290.4324 1299.9206 1314.1915 1329.0511 1336.3083 1339.8791 1341.4521 1351.1963 1365.6928 1391.0899 1426.8582 1457.5225 1460.5048 1462.5230 1468.0124 1468.5315 1475.1795 1477.1258 1665.9034 2931.3671 2947.1972 2959.4764 2962.7002 2966.2456 2967.4017 2971.7018 3016.1623 3027.1200 3030.5754 3032.0961 3034.9825 3038.8385 3046.7436 3083.0622 3084.4093 3186.7836 3537.5445
redmass: 2.8814 2.8650 3.0128 3.1970 1.2736 1.6693 4.3958 1.1903 1.5930 2.3581 2.7749 2.7747 2.1600 3.4410 2.8768 2.6463 2.1265 1.9715 1.1185 1.9838 2.3730 1.9715 2.0613 2.3916 1.5000 1.7715 1.3448 1.8642 1.8927 2.6383 1.3864 1.5055 1.3668 2.1705 1.5892 1.7143 2.5915 1.7949 1.3292 1.4996 1.5037 1.2885 1.2320 1.3292 1.5673 1.9989 1.3653 1.4055 1.4354 1.4683 1.4939 1.4980 1.2100 1.2396 1.1750 1.0797 1.0916 1.0886 1.0737 1.0665 1.0933 1.0720 4.9822 1.0801 1.0670 1.0624 1.0415 1.0585 1.0618 1.0622 1.0856 1.0999 1.0961 1.0987 1.0965 1.0983 1.0997 1.0979 1.0629 1.1139 1.0656
irintensity: 0.1907 0.1665 0.5785 1.8382 0.7157 2.5972 1.6201 109.9207 14.1689 5.0136 6.6981 16.2655 6.0721 4.1869 2.1368 4.1252 3.6266 9.8371 1.2814 2.0345 3.4140 4.4022 14.8021 8.7738 5.6497 7.2826 82.8953 5.6259 17.3357 60.5411 11.9220 3.6150 3.6231 3.8253 5.6877 6.4778 2.9258 0.6380 9.5103 5.5827 6.6489 0.5153 3.1492 8.3775 1.9378 19.9337 2.7141 0.4486 0.1259 0.5515 2.2656 2.1334 31.4181 23.9409 0.6033 3.7336 5.1197 10.1853 26.7942 14.5117 4.4755 14.1074 29.9480 6.6342 33.6537 9.4939 44.6134 13.4097 43.6473 34.6124 16.8786 24.5451 57.6083 48.1092 26.6690 33.6472 111.7987 33.4925 6.9116 28.8401 4.9712
temp: 298.150 k
press: 1.00000 atm
elementType: 8 6 6 6 6 6 6 6 6 6 6 1 1 1 1 1 1 1 1 1 1 1 1 1 1 1 1 1 1
symmnumber: 1
zpe: 678306.2 jmol-1
zpe.correction: 0.258353 hartree
zpe.thermalcorrener: 0.270589 hartree
zpe.thermalcorrenthalpy: 0.271533 hartree
zpe.thermalcorrgfe: 0.219811 hartree
zpe.sumelectzpe: -466.173114 hartree
zpe.sumelectthermal: -466.160878 hartree
zpe.sumelectthermalent: -466.159933 hartree
zpe.sumelectthermalfe: -466.211656 hartree
dipole: -0.7904 -1.2978 1.6467
dipole: 2.2407
quadrupole: -70.0507 -75.2321 -66.1761
quadrupole: 1.4765 0.6200 4.9934
quadrupole: 0.4356 -4.7458 4.3102 1.4765 0.6200 4.9934
hfenergy: -466.4314668 hartree
pointgroup: C01 [X(C10H18O1)]
dipole: 0.306141 -0.5827538 -0.5863645 debye
polarizability: 124.5155461|5.9103493|100.6656045|-5.7109451|-7.1708455|98.9652547 unknown
InChI: InChI=1S/C10H18O/c1-8(2)7-9-5-3-4-6-10(9)11/h9-11H,1,3-7H2,2H3
charge 0 multiplicity 1
29 atoms
O  1.125289 2.392348 -0.126967
C  0.071585 0.11406 -0.099366
C  1.297668 0.981063 0.289053
C  0.305821 -1.36043 0.324089
C  2.615263 0.406137 -0.272074
C  1.618727 -1.93753 -0.252025
C  2.830352 -1.066199 0.153092
C  -1.234029 0.693357 0.51815
C  -2.517258 0.044003 0.01656
C  -2.825797 0.1989 -1.46428
C  -3.360007 -0.621433 0.852086
H  -0.008525 0.146905 -1.209974
H  1.358163 1.051867 1.392059
H  -0.561181 -1.974311 0.014452
H  0.34021 -1.408465 1.433613
H  3.455816 1.044049 0.059515
H  2.581699 0.460831 -1.382753
H  1.549662 -1.975326 -1.359281
H  1.761141 -2.979022 0.095493
H  2.96351 -1.114528 1.2536
H  3.762158 -1.457503 -0.298462
H  -1.253281 1.779736 0.294776
H  -1.174818 0.593088 1.620334
H  1.160547 2.425581 -1.118015
H  -3.817276 -0.213713 -1.717825
H  -2.80685 1.266309 -1.760054
H  -2.073991 -0.318799 -2.092056
H  -3.139744 -0.730096 1.920938
H  -4.294654 -1.069479 0.493724
