program: Gaussian 09
title: 000255877
version: EM64L-G09RevD.01
frameworkgroup: C1[X(C22H22N4O2)]
method: RPBEPBE
basis: SDD
operation: Freq
keyword: #p
keyword: freq=noraman
keyword: PBEPBE/SDD
title: #p freq=noraman PBEPBE/SDD
converged: YES YES NO NO
title: Mulliken charges:
elementType: O O N N N N C C C C C C C C C C C C C C C C C C C C C C H H H H H H H H H H H H H H H H H H H H H H
charge: -0.295443 -0.305201 -0.432809 -0.397314 -0.495634 -0.493068 0.474629 0.495460 -0.534223 -0.496008 -0.568755 -0.444137 -0.446357 -0.214257 0.292215 0.298601 0.472577 0.467330 -0.437032 -0.345031 -0.450150 -0.364728 -0.207675 -0.216089 -0.196179 -0.209416 -0.264601 -0.270448 0.303145 0.225747 0.275649 0.227278 0.266582 0.237754 0.231782 0.226361 0.291447 0.283397 0.301210 0.290094 0.223686 0.306220 0.216351 0.317134 0.221271 0.222736 0.226848 0.232577 0.224975 0.231502
chargesum: 0.00000
title: Mulliken charges with hydrogens summed into heavy atoms:
elementType: O O N N N N C C C C C C C C C C C C C C C C C C C C C C
charge: -0.295443 -0.305201 -0.141362 -0.113917 -0.194424 -0.202973 0.474629 0.495460 -0.231079 0.005388 -0.074895 -0.206383 -0.214575 0.012104 0.292215 0.298601 0.472577 0.467330 -0.213346 -0.038810 -0.233799 -0.047594 0.013596 0.006647 0.030669 0.023161 -0.039626 -0.038946
polarizability: 3.94611022e+02 1.92386633e+01 2.70502330e+02 1.57701050e+01 -2.42396916e+01 1.67762314e+02
1716.lowfreq: -2.7814 -0.0005 0.0001 0.0003 3.2726 4.1486 12.0801 15.9235 21.9977
frequency: 11.8217 15.9205 21.9439 23.8371 31.5612 50.7142 55.5509 63.7031 74.6621 81.6535 108.8099 125.4195 151.9892 185.5999 210.2139 227.1787 234.1275 243.2463 253.4637 260.9099 289.9301 328.7442 340.6334 342.1939 389.1124 399.8676 407.8456 410.1813 414.3353 443.6180 464.7190 505.8480 512.0629 513.0806 572.7299 584.3239 592.6087 596.1832 604.6577 613.5631 616.9890 640.6823 696.4967 696.7320 697.1028 701.3261 706.9111 709.6666 722.6214 751.9038 764.5276 766.5030 804.1210 831.6477 834.2057 838.4352 845.3290 901.7320 910.2323 911.2675 916.4560 934.9696 938.6259 964.8742 967.0068 971.7200 982.8124 983.7348 985.3973 988.8660 995.4055 1002.9577 1013.1404 1025.5231 1025.9412 1034.5712 1078.6813 1086.4196 1089.4954 1093.6623 1115.4194 1165.2782 1170.5784 1172.2609 1181.5499 1187.6134 1188.9327 1206.6599 1211.9364 1229.1847 1240.5271 1255.2797 1264.4342 1270.1485 1305.1662 1318.0464 1321.3205 1347.8318 1351.8523 1382.5253 1384.0923 1390.4607 1424.0149 1427.8204 1440.0779 1449.0518 1473.5679 1478.3186 1482.2209 1483.5894 1487.5783 1491.1357 1509.0348 1518.8118 1597.3643 1598.5725 1599.3999 1614.0467 1617.3335 1618.5684 1635.2001 1643.4360 2968.2702 3016.0276 3028.1060 3081.8500 3105.6320 3107.9390 3113.0350 3120.9283 3128.1087 3129.6286 3138.5492 3140.9338 3142.0919 3151.2623 3161.7105 3164.7682 3189.7707 3193.2657 3518.7148 3525.4321 3540.4278 3550.8662
redmass: 5.5849 4.9596 5.6046 4.6761 4.8388 4.7119 5.8508 6.0498 5.2002 5.9609 5.0364 5.2744 4.3072 3.9381 3.3653 4.1784 3.2610 3.8038 4.1567 4.5384 3.4667 3.1394 5.9767 5.5346 1.8116 1.5559 2.8691 2.9771 2.1929 2.6325 3.8664 3.8389 2.8341 2.7033 3.5485 1.3274 2.3263 1.9749 5.5399 6.1319 6.0969 5.0000 2.3195 4.1059 2.0973 8.0739 6.9206 3.5570 2.7440 3.6642 1.6845 1.6806 1.7679 4.4749 4.6047 1.3365 1.2764 1.7754 1.8465 1.6524 1.4286 2.1217 2.7167 2.0531 1.3467 1.3498 5.7198 5.7796 1.3571 6.1797 1.3057 1.3082 2.5524 2.2409 2.2357 2.3494 2.8945 1.8030 1.6060 2.0531 2.9135 1.8214 1.0570 1.0520 1.0931 1.1124 1.1138 1.6898 1.5758 1.2956 1.6103 1.9777 2.2656 2.2345 1.3774 1.4709 1.4591 1.5294 1.3188 5.2789 5.5078 4.6750 2.2748 2.3966 2.2479 1.2094 1.9412 1.2114 1.9007 1.8722 2.1614 2.2365 2.2382 2.3024 5.9562 6.0263 5.7492 5.6655 5.7035 5.9428 4.3483 4.3049 1.0643 1.0611 1.0959 1.1026 1.0887 1.0877 1.0864 1.0916 1.0870 1.0869 1.0935 1.0919 1.0930 1.0986 1.0996 1.0997 1.0948 1.0949 1.0763 1.0763 1.0770 1.0771
irintensity: 2.8297 0.7134 0.3662 0.0124 3.0452 7.3404 0.3820 10.9527 10.5166 1.6851 0.0949 1.2859 1.0339 5.2710 9.0914 1.3051 0.7685 1.1491 0.3479 3.8066 15.7247 1.6725 1.5339 10.2609 17.8378 54.1319 1.1311 0.2299 12.3387 13.7923 19.1597 13.1300 123.1229 3.3103 7.1318 116.6351 7.2802 131.6713 0.8810 3.2552 2.0285 3.8641 63.1713 43.2151 3.3097 5.5924 15.3919 10.4257 20.6992 11.4382 73.4655 127.7433 33.1391 0.9729 1.9411 2.5872 0.8268 0.3008 10.5986 15.6311 6.2282 2.5493 6.6059 8.2526 0.3141 0.1073 1.1740 2.0519 0.2881 0.5448 3.2444 2.3294 2.9896 12.4310 2.4193 12.9281 7.7362 7.1877 32.7783 0.5477 5.3818 14.8727 1.0071 0.9638 2.9773 8.1446 6.3044 115.5558 211.2167 177.0996 34.9204 184.8219 5.4024 20.0389 3.5572 64.0710 57.0115 4.1424 4.1663 37.6766 91.4132 5.2590 47.4369 42.4342 64.9096 12.2865 80.0684 116.7396 53.8746 302.2759 8.3144 8.4123 203.1779 965.7284 45.8488 50.7643 13.3053 48.6059 79.7778 27.0418 155.4407 121.0542 55.9557 45.2488 12.7852 4.0804 18.3283 15.3180 1.1399 24.3255 1.0192 2.5154 40.0338 1.5426 28.0532 39.8434 27.1228 21.6911 7.5069 7.7058 11.0560 7.1376 20.8175 18.6409
temp: 298.150 k
press: 1.00000 atm
elementType: 8 8 7 7 7 7 6 6 6 6 6 6 6 6 6 6 6 6 6 6 6 6 6 6 6 6 6 6 1 1 1 1 1 1 1 1 1 1 1 1 1 1 1 1 1 1 1 1 1 1
symmnumber: 1
zpe: 1050649.1 jmol-1
zpe.correction: 0.400171 hartree
zpe.thermalcorrener: 0.425379 hartree
zpe.thermalcorrenthalpy: 0.426323 hartree
zpe.thermalcorrgfe: 0.340304 hartree
zpe.sumelectzpe: -1219.063293 hartree
zpe.sumelectthermal: -1219.038085 hartree
zpe.sumelectthermalent: -1219.037141 hartree
zpe.sumelectthermalfe: -1219.123161 hartree
dipole: -4.5735 5.9368 -3.7061
dipole: 8.3605
quadrupole: -136.7398 -161.3888 -167.0561
quadrupole: -3.6075 3.4088 -4.2477
quadrupole: 18.3217 -6.3272 -11.9945 -3.6075 3.4088 -4.2477
hfenergy: -1219.4634642 hartree
pointgroup: C01 [X(C22H22N4O2)]
dipole: -0.9434209 -2.2439233 2.2122409 debye
polarizability: 392.8256238|24.3155472|247.1291369|-7.8208218|-52.6224978|192.920906 unknown
InChI: InChI=1S/C22H22N4O2/c27-21(25-19-10-3-1-4-11-19)23-15-17-8-7-9-18(14-17)16-24-22(28)26-20-12-5-2-6-13-20/h1-14,23-26H,15-16H2
charge 0 multiplicity 1
50 atoms
O  -0.795063 3.59177 -1.231832
O  -0.33884 -1.865279 -0.98185
N  -1.430395 2.134027 0.480562
N  -2.050437 -3.121099 -0.001472
N  0.823677 2.261187 -0.12508
N  0.113081 -3.223493 0.899219
C  -3.65317 1.041581 0.21666
C  -3.780836 -1.34514 -0.391118
C  -3.065174 -0.123765 -0.325737
C  -2.866988 2.349632 0.285454
C  -3.079929 -2.593562 -0.925263
C  -4.990928 0.981073 0.684557
C  -5.120114 -1.387266 0.0666
C  -5.723394 -0.223091 0.598161
C  -0.481323 2.727225 -0.35804
C  -0.728008 -2.679071 -0.087581
C  2.035778 2.737614 -0.694633
C  1.480771 -2.913927 1.143328
C  3.240839 2.110585 -0.27155
C  2.091814 3.793757 -1.643963
C  2.094391 -3.530797 2.269103
C  2.243333 -2.033798 0.3267
C  4.482883 2.533127 -0.786028
C  3.345293 4.205458 -2.146038
C  3.445486 -3.273926 2.576571
C  3.595414 -1.786003 0.652075
C  4.545858 3.586501 -1.728117
C  4.20771 -2.396278 1.770406
H  -2.03605 -0.092244 -0.701154
H  -3.284418 2.993111 1.086451
H  -2.957322 2.922132 -0.658025
H  -3.811211 -3.398655 -1.12084
H  -2.556469 -2.364083 -1.869284
H  -5.459296 1.875918 1.113529
H  -5.690272 -2.323353 0.009627
H  -6.759575 -0.257505 0.9531
H  -1.139785 1.517467 1.240566
H  -2.377298 -3.60309 0.838005
H  0.925083 1.442331 0.479501
H  -0.28562 -3.935141 1.515364
H  3.201979 1.296026 0.46399
H  1.163614 4.262754 -1.9750
H  1.511911 -4.211814 2.904167
H  1.778849 -1.579824 -0.550602
H  5.402034 2.041366 -0.447188
H  3.378825 5.020561 -2.878163
H  3.90157 -3.760083 3.446127
H  4.177479 -1.117718 0.006518
H  5.510625 3.91581 -2.128363
H  5.258418 -2.198707 2.006774
