program: Gaussian 09
title: 000250461
version: EM64L-G09RevD.01
frameworkgroup: C1[X(C10H7ClO2)]
method: RPBEPBE
basis: SDD
operation: Freq
keyword: #p
keyword: freq=noraman
keyword: PBEPBE/SDD
title: #p freq=noraman PBEPBE/SDD
converged: NO NO NO NO
title: Mulliken charges:
elementType: Cl O O C C C C C C C C C C H H H H H H H
charge: -0.046152 -0.277662 -0.161155 0.264390 0.350068 -0.544481 -0.336337 0.165355 -0.361827 -0.340865 -0.208411 -0.210843 -0.110801 0.269714 0.269632 0.248960 0.231152 0.281743 0.257798 0.259721
chargesum: 0.00000
title: Mulliken charges with hydrogens summed into heavy atoms:
elementType: Cl O O C C C C C C C C C C
charge: -0.046152 -0.277662 -0.161155 0.264390 0.350068 -0.005134 -0.087377 0.165355 -0.130675 -0.059122 0.049387 0.048879 -0.110801
polarizability: 2.16632844e+02 -1.10994169e+01 1.17555609e+02 -1.30444590e-02 -1.75894095e-02 5.12539303e+01
1716.lowfreq: -0.0032 -0.0030 0.0006 2.6225 4.2287 5.5058 41.5708 61.1729 102.1727
frequency: 41.5677 61.1587 102.1703 143.3659 197.6396 243.4476 271.4312 306.6019 382.3265 406.0850 473.2043 476.6667 515.3429 517.3373 621.8869 631.2268 651.7229 707.4086 709.9238 751.0694 791.8119 825.8504 849.1807 849.7240 935.1631 957.1699 980.6987 983.5904 994.7885 1009.4247 1046.2233 1075.4571 1112.6380 1123.3386 1189.2915 1244.0348 1251.5485 1291.7441 1299.9532 1368.1171 1404.6537 1416.8341 1478.2482 1574.2413 1603.1697 1646.0030 1734.7338 2999.9722 3046.2434 3143.4194 3161.5971 3171.3091 3182.3209 3218.1821
redmass: 4.2941 7.3686 8.7880 11.2284 2.8537 11.0201 7.8999 4.4615 6.0738 2.8815 2.9969 8.5955 2.9405 5.0215 7.2524 4.0911 8.8397 2.1570 7.1273 1.5440 8.1019 1.3616 8.9246 1.4664 2.2639 1.3639 1.3593 5.8860 1.8935 3.8573 3.7952 2.7040 1.3743 1.1566 1.1219 1.8400 2.3344 1.9544 1.4990 5.7729 3.7584 1.0890 2.4835 7.4437 6.2676 8.0195 12.8262 1.0609 1.0994 1.0889 1.0893 1.0965 1.0970 1.0972
irintensity: 3.5823 0.3303 1.5842 0.2313 6.5419 0.7571 1.5425 4.0913 1.1549 0.0472 12.1110 19.5918 0.1966 6.4846 1.0927 7.8518 0.4237 7.2493 23.4245 64.3201 104.5196 18.6064 44.5537 42.0502 0.0001 0.1001 0.7326 147.9486 90.6379 18.3117 97.8938 44.4147 12.3229 1.4385 2.2299 25.1086 8.1049 53.3098 15.7077 5.9096 12.7371 20.5448 76.1245 1.9959 24.9254 30.8293 377.3384 10.4014 1.9660 6.0123 1.6270 4.2930 0.5501 7.4697
temp: 298.150 k
press: 1.00000 atm
elementType: 17 8 8 6 6 6 6 6 6 6 6 6 6 1 1 1 1 1 1 1
symmnumber: 1
zpe: 371872.7 jmol-1
zpe.correction: 0.141639 hartree
zpe.thermalcorrener: 0.152467 hartree
zpe.thermalcorrenthalpy: 0.153411 hartree
zpe.thermalcorrgfe: 0.103632 hartree
zpe.sumelectzpe: -994.852487 hartree
zpe.sumelectthermal: -994.841658 hartree
zpe.sumelectthermalent: -994.840714 hartree
zpe.sumelectthermalfe: -994.890493 hartree
dipole: -0.0297 4.0461 0.0051
dipole: 4.0462
quadrupole: -94.0931 -75.4809 -83.6113
quadrupole: -14.4843 -0.0122 -0.0092
quadrupole: -9.6980 8.9142 0.7838 -14.4843 -0.0122 -0.0092
hfenergy: -994.9941254 hartree
pointgroup: C01 [X(C10H7Cl1O2)]
dipole: 0.0155236 -1.5891738 -0.091866 debye
dipolederiv: -0.9882818 -0.1174861 0.0295578 -0.1053471 -0.1345573 0.0001643 0.0300393 0.0006211 -0.0643919 -1.6803064 0.5381998 0.0901757 0.0531466 -0.5148804 -0.0210802 0.0634392 -0.0404563 -0.1863824 -1.0583087 0.3764104 0.0512389 0.6261213 -0.7390572 -0.0493491 0.0648745 -0.0389001 -0.319817 0.9267933 -0.146316 -0.042009 -0.5068534 0.6115856 0.0504754 -0.0630522 0.0357179 0.0829604 -0.0141805 0.0677757 0.0052846 0.1518038 -0.0638837 -0.011128 0.0100768 -0.0077715 0.0248221 -0.0679491 -0.081935 0.0049685 -0.1214643 -0.3943023 -0.0277798 0.002704 -0.0298336 0.1751819 -0.1376155 -0.0944463 -0.0119011 -0.0546237 -0.1875926 0.00888 -0.0090957 0.0109821 -0.3029416 2.0577067 -0.6221799 -0.1085347 -0.3511606 0.9317568 0.0544625 -0.0933398 0.065181 0.2350216 0.019149 0.0377501 -0.0038026 -0.072113 0.0591882 0.0136384 -0.0097926 0.0094883 -0.1323658 0.0614711 -0.0580292 -0.0105823 0.041413 0.0230553 0.0066488 -0.0048836 0.010601 -0.1265376 -0.3439486 -0.1287041 0.0022733 -0.1989368 -0.0432033 0.0110002 -0.001733 0.0082224 -0.1002796 -0.3963305 0.0558915 0.0143495 0.136749 0.0466348 0.0029481 0.0185882 0.0060818 -0.1055875 1.3454366 0.1499548 -0.0465887 0.1563333 0.1598096 0.0065671 -0.0458165 0.0068739 -0.066202 -0.0099399 -0.0164522 -0.0675315 0.0629698 0.1276117 -0.0239042 -0.1081542 -0.0466294 0.0313363 0.0042117 -0.0200834 0.0680592 0.0520748 0.1186153 0.0301452 0.1172962 0.0589353 0.0260823 0.0599003 0.0852972 0.0100935 0.1132568 0.0034958 -0.0152774 0.011517 -0.0143135 0.1911267 0.0496186 -0.0927464 -0.0013859 -0.0613107 -0.0453435 -0.0082967 0.0004545 -0.0071262 0.1460188 0.0867631 0.0564463 0.0060727 0.0691458 0.0374615 -0.0096457 0.0068799 -0.0090983 0.1621796 0.0262302 0.0682576 0.0092891 0.0690327 0.0157728 -0.0110703 0.0092537 -0.011061 0.1651589 0.0595803 -0.0576048 0.0009729 -0.0602374 -0.0121672 -0.0073985 0.0007443 -0.0075151 0.1646169 unknown
polarizability: 215.9665643|13.1259986|117.815106|-5.7707921|3.2013882|51.6607137 unknown
InChI: InChI=1S/C10H7ClO2/c11-8-3-1-7(2-4-8)9-5-6-10(12)13-9/h1-5H,6H2
charge 0 multiplicity 1
20 atoms
Cl 4.97927 0.390342 -0.094409
O  -1.839186 0.852006 0.20064
O  -4.122386 1.356273 0.320683
C  -1.075066 -0.365065 0.101555
C  0.379655 -0.187657 0.053443
C  -3.326739 -1.031898 0.152977
C  -1.883108 -1.465458 0.07142
C  -3.240261 0.496153 0.236999
C  1.247967 -1.310477 -0.043271
C  0.944237 1.11643 0.103171
C  2.644013 -1.139486 -0.088636
C  2.34162 1.298992 0.058171
C  3.174063 0.167366 -0.03686
H  -3.932226 -1.315089 -0.729089
H  -3.862477 -1.416238 1.041859
H  -1.55357 -2.500608 -0.000825
H  0.837757 -2.325091 -0.083913
H  0.281141 1.982632 0.177046
H  3.310959 -2.003324 -0.162807
H  2.773636 2.303199 0.096545
