program: Gaussian 09
title: 000250460
version: EM64L-G09RevD.01
frameworkgroup: C1[X(C7H13NO)]
method: RPBEPBE
basis: SDD
operation: Freq
keyword: #p
keyword: freq=noraman
keyword: PBEPBE/SDD
title: #p freq=noraman PBEPBE/SDD
converged: YES YES NO NO
title: Mulliken charges:
elementType: O N C C C C C C C H H H H H H H H H H H H H
charge: -0.450712 -0.081903 -0.012252 -0.411988 -0.519302 -0.406968 -0.514835 0.184388 -0.733538 0.214471 0.185080 0.208675 0.233416 0.203513 0.207656 0.210236 0.211293 0.267574 0.207337 0.216812 0.217991 0.363057
chargesum: 0.00000
title: Mulliken charges with hydrogens summed into heavy atoms:
elementType: O N C C C C C C C
charge: -0.087655 -0.081903 0.202219 -0.018234 -0.082373 0.010924 -0.035968 0.184388 -0.091398
polarizability: 1.10589782e+02 -3.37798335e+00 8.24362100e+01 -5.27662788e+00 2.01906873e+00 6.47334776e+01
1716.lowfreq: -12.0030 -5.8788 -0.0006 0.0005 0.0005 24.0523 74.5300 120.1127 210.5728
frequency: 74.5001 120.0922 210.5676 214.3026 269.6062 301.4543 306.9156 345.4330 396.2992 405.2892 432.3512 477.3821 556.2802 646.8389 756.1894 795.9881 842.9013 852.6742 870.1203 893.3934 945.1015 963.8773 977.4799 1061.7076 1086.3418 1088.4027 1111.2440 1135.6540 1206.1023 1211.5323 1234.6612 1260.5741 1273.6810 1300.8953 1313.7917 1326.5702 1337.2968 1343.8559 1355.1354 1386.7879 1447.8550 1456.2676 1463.7019 1470.1879 1475.1851 1476.6005 1621.3365 2949.3376 2955.2281 2967.8410 2970.1529 2972.1898 2983.2184 3025.3715 3045.2127 3055.0139 3065.2772 3070.4595 3086.6172 3569.2577
redmass: 3.4878 2.7288 1.0369 2.9770 2.0867 3.7477 3.0641 2.8426 3.2625 1.3061 1.6677 2.2047 3.5216 4.0195 2.2660 3.4728 1.6919 1.5023 2.7931 2.9714 2.0653 1.4310 1.6096 2.0582 1.1385 1.9331 1.8942 2.2208 1.4260 1.4870 1.6150 1.2888 1.2445 1.4350 1.3105 1.3898 1.8497 1.4481 1.6378 1.2142 1.0900 1.0886 1.0834 1.0888 1.0482 1.0557 6.9981 1.0698 1.0651 1.0608 1.0512 1.0668 1.0616 1.0973 1.1025 1.0954 1.0988 1.0993 1.0935 1.0674
irintensity: 0.0116 0.1419 0.0244 0.0615 1.2935 3.6005 1.2864 9.2503 2.8266 105.0511 26.2312 10.7472 16.1197 10.7775 0.1390 34.9050 25.5563 3.9146 63.7225 14.6156 18.3189 11.8941 1.9796 11.9141 2.0759 2.0593 7.6138 3.7211 22.8036 22.7708 28.9913 1.3189 7.9323 3.6719 3.9294 4.4917 8.2922 4.2670 1.2391 11.5833 7.5604 11.8400 12.3848 8.0488 16.9537 8.4389 7.8873 7.7704 15.1054 13.3563 56.5171 47.7637 31.4399 55.5640 48.9685 8.9678 71.5656 42.2986 10.7125 35.5743
temp: 298.150 k
press: 1.00000 atm
elementType: 8 7 6 6 6 6 6 6 6 1 1 1 1 1 1 1 1 1 1 1 1 1
symmnumber: 1
zpe: 501328.5 jmol-1
zpe.correction: 0.190946 hartree
zpe.thermalcorrener: 0.200309 hartree
zpe.thermalcorrenthalpy: 0.201253 hartree
zpe.thermalcorrgfe: 0.157070 hartree
zpe.sumelectzpe: -403.749199 hartree
zpe.sumelectthermal: -403.739836 hartree
zpe.sumelectthermalent: -403.738891 hartree
zpe.sumelectthermalfe: -403.783075 hartree
dipole: -1.1869 0.5391 0.0560
dipole: 1.3048
quadrupole: -53.2825 -55.7490 -54.7425
quadrupole: -1.4637 -1.5237 0.7223
quadrupole: 1.3088 -1.1577 -0.1512 -1.4637 -1.5237 0.7223
hfenergy: -403.9401448 hartree
pointgroup: C01 [X(C7H13N1O1)]
dipole: -0.4666829 -0.2118587 -0.0294197 debye
dipolederiv: -1.226252 0.0563128 -0.1229545 0.6755464 -0.1024924 0.1986302 -0.0694875 0.077882 -0.3844799 0.6793943 -0.0167407 0.1868286 -0.5707415 -0.3151719 -0.1138797 0.0841296 -0.032513 -0.1641833 0.1250714 0.0223536 -0.0111206 0.1032184 0.0971769 0.0168581 -0.1040581 0.0230609 0.1557865 0.0060012 0.0447845 0.0070047 0.0383901 0.0122316 -0.0053892 0.0349119 0.0182534 0.1518742 -0.1308238 0.0268989 0.029841 -0.046894 -0.0056356 0.0116066 0.0354852 -0.0065036 0.1359544 0.145419 0.0704102 0.0187933 0.0241481 0.095514 0.0006396 -0.0209576 -0.0459285 0.1429243 -0.1287047 -0.0459119 -0.0051008 -0.0002247 -0.1527383 -0.0271448 -0.0236116 -0.0254212 0.1645979 0.1835882 -0.0484403 0.0689594 -0.0575727 0.3229362 0.0733282 0.1632494 0.1063984 -0.0463179 -0.0617859 0.0497721 -0.0092716 0.0232835 0.0182857 0.0123397 0.0332505 0.0015242 0.0989883 0.0213083 -0.0117596 -0.0682172 -0.0043859 0.0289735 0.0062914 -0.032868 -0.0103596 -0.1718728 0.0487171 0.0164179 -0.0441161 0.0286649 0.0377576 0.0115973 -0.0944772 -0.0421839 -0.1778464 -0.1261335 -0.1070785 0.0901172 -0.0921102 -0.0047615 0.0422395 0.1135562 0.0679988 0.0172882 0.073153 -0.0299397 0.0055208 -0.0011383 -0.1368768 -0.0322489 0.0148439 -0.0623203 0.0707435 -0.0121458 0.0123127 -0.0804588 0.0185692 0.0917332 -0.0335221 -0.0628124 0.020888 -0.1400478 0.0103542 -0.0147554 0.0041034 -0.0101213 -0.2236335 -0.0421525 0.0130579 -0.0709756 0.0688942 0.0120485 0.0035608 -0.0290491 -0.0091611 0.0880562 -0.0279116 -0.0281995 0.0445951 -0.168255 0.0983811 -0.0239864 -0.0605846 -0.0574331 0.0359283 -0.00363 -0.0182393 -0.0304082 -0.1368193 -0.0535019 0.0951777 -0.0046929 0.0456236 0.04575 0.0095336 -0.015874 0.0383882 0.0905471 0.0596618 0.0153081 -0.0112879 0.0000917 0.0827369 -0.039125 -0.0912358 0.0035267 -0.1638143 -0.1172355 -0.0515421 0.0833119 -0.1079656 0.0407578 0.0738241 0.1075228 0.0569473 0.0221823 0.0736337 -0.0164641 -0.0158186 0.0552484 -0.1810665 -0.0606905 -0.005255 -0.0627608 0.075372 0.3198513 -0.0466905 -0.0318078 -0.0550359 0.1245388 -0.0711939 -0.0329313 -0.0700883 0.3584839 unknown
polarizability: 110.4958933|3.278861|82.3662067|5.7117052|2.3409521|64.8973696 unknown
InChI: InChI=1S/C7H13NO/c1-6-3-2-4-7(5-6)8-9/h6,9H,2-5H2,1H3
charge 0 multiplicity 1
22 atoms
O  3.145883 0.266278 0.306789
N  1.908942 1.07622 0.166838
C  -1.572469 0.343287 0.354467
C  -1.606008 -1.160689 -0.020403
C  -0.423478 1.057083 -0.416639
C  -0.249245 -1.852746 0.244957
C  0.91385 -1.153876 -0.51344
C  0.900256 0.336221 -0.238436
C  -2.924887 1.034996 0.084609
H  -1.346859 0.419003 1.439806
H  -1.867586 -1.256823 -1.096091
H  -2.408772 -1.669377 0.548855
H  -0.321511 2.107904 -0.091415
H  -0.684684 1.065933 -1.497107
H  -0.294377 -2.916646 -0.056616
H  -0.033021 -1.834318 1.331559
H  0.77574 -1.309282 -1.603804
H  1.889435 -1.584482 -0.235849
H  -3.186095 0.982132 -0.989998
H  -3.740576 0.552197 0.654165
H  -2.895455 2.10233 0.372646
H  3.789419 0.950257 0.624408
