program: Gaussian 09
title: 000255830
version: EM64L-G09RevD.01
frameworkgroup: C1[X(C19H24O2)]
method: RPBEPBE
basis: SDD
operation: Freq
keyword: #pfreq=noraman
keyword: PBEPBE/SDD
title: #p freq=noraman PBEPBE/SDD
converged: NO YES NO NO
title: Mulliken charges:
elementType: O O C C C C C C C C C C C C C C C C C C C H H H H H H H H H H H H H H H H H H H H H H H H
charge: -0.265147 -0.281680 0.352255 0.306335 -0.246465 -0.374268 -0.596584 -0.199602 -0.561277 -0.486448 -0.474536 -0.791564 -0.769171 0.273837 -0.480805 0.469374 -0.364398 -0.390268 -0.231144 -0.226273 -0.234194 0.287131 0.257416 0.262300 0.234124 0.233822 0.242362 0.219777 0.216347 0.227271 0.217222 0.218392 0.230709 0.203612 0.221621 0.203288 0.234522 0.216115 0.239549 0.221652 0.268646 0.232967 0.227586 0.226582 0.229009
chargesum: 0.00000
title: Mulliken charges with hydrogens summed into heavy atoms:
elementType: O O C C C C C C C C C C C C C C C C C C C
charge: -0.265147 -0.281680 0.352255 0.306335 0.040666 -0.116853 -0.100160 0.034220 -0.099139 -0.042830 -0.038922 -0.135621 -0.115246 0.273837 -0.019605 0.469374 -0.095752 -0.157302 -0.003558 0.000309 -0.005185
polarizability: 2.21193638e+02 1.09479399e+01 1.93726308e+02 1.76914490e+01 -6.58677233e+00 1.79285740e+02
1716.lowfreq: -11.0419 -7.2809 -0.0007 -0.0003 0.0003 5.5666 14.3165 24.4773 32.1683
frequency: 12.7548 24.4140 32.0000 58.5042 75.2912 89.5267 126.6924 172.9260 195.1108 215.4026 224.0274 228.3130 241.0273 260.0848 279.6568 306.1249 320.0392 354.1384 363.7871 400.1699 405.2411 416.5032 429.0665 451.8279 481.0235 498.5016 563.6494 584.8625 596.2768 617.6031 647.0029 686.3449 704.7077 721.4311 746.8259 756.0570 798.4887 802.5143 810.7239 816.6424 842.2526 858.3393 864.0639 882.2988 893.2331 901.9012 928.2822 933.8687 935.2702 949.2955 957.3964 966.4908 972.4545 977.0599 983.1086 987.3882 990.3148 1000.5246 1006.6852 1022.8292 1026.8878 1059.5444 1066.7543 1082.8414 1090.3421 1095.8195 1109.5730 1116.1580 1134.7208 1168.9265 1172.8973 1188.0957 1189.7761 1192.6232 1204.3941 1221.1990 1225.2280 1228.1070 1234.2859 1245.4168 1268.4756 1286.0748 1291.8730 1312.0953 1326.1456 1329.6020 1344.9801 1373.4539 1385.3305 1390.3976 1397.9564 1442.2977 1447.6470 1459.6001 1459.8340 1466.2322 1468.8539 1478.1912 1482.9729 1484.3947 1488.7482 1504.5933 1594.3801 1614.3824 1617.2946 2971.9538 2976.8911 2997.3056 3010.4612 3015.3456 3034.7716 3046.6980 3053.0904 3055.8603 3063.1464 3074.7133 3081.4078 3082.8472 3085.4184 3087.1344 3090.5919 3109.3375 3119.7476 3127.9396 3140.2415 3151.1349 3163.0563 3164.8252 3189.0921
redmass: 4.2540 4.3859 3.7743 4.2294 3.7890 4.1863 6.1964 4.0511 1.9118 2.1804 1.6361 2.4773 2.6570 4.2044 1.7173 2.6099 2.3708 2.4267 2.3723 3.0399 2.8176 2.5654 2.6460 2.7703 2.5437 3.7823 4.1251 3.3737 4.1579 6.2820 3.9069 3.7559 1.8431 4.2921 3.2756 2.1889 1.7958 2.3429 2.1068 3.5171 5.0865 1.3942 2.7278 2.3591 2.4378 2.1349 1.5097 2.7393 1.4739 1.7955 1.6019 1.6607 1.7310 1.9607 1.4243 1.5057 4.5654 1.3388 3.3098 1.3950 2.2013 1.6788 1.3907 1.4042 1.5111 1.2575 1.3685 2.0019 1.8260 2.4468 1.0540 1.1258 1.8840 1.9485 1.8250 2.8679 1.7592 1.7207 1.1666 1.7418 1.3830 1.7122 1.7382 1.4991 1.6988 1.2671 1.3824 1.2213 7.9562 1.7349 1.3493 2.1816 1.3157 1.0579 1.1323 1.0696 1.0726 1.0728 1.0776 2.2795 1.0692 1.0766 6.1185 6.1869 8.7604 1.0361 1.0363 1.0600 1.0653 1.0613 1.0584 1.0888 1.1009 1.0992 1.0976 1.1022 1.1005 1.0980 1.0588 1.0999 1.0900 1.1073 1.0863 1.0874 1.0922 1.0963 1.0903 1.1016 1.1138
irintensity: 0.1250 0.3089 0.0294 0.4937 0.1179 1.5886 2.0464 1.7026 1.3058 1.5095 1.3299 1.1678 2.4822 2.6135 0.6765 1.5389 0.6045 3.1359 9.9168 2.2233 0.1832 0.7547 1.2545 0.4592 3.0406 4.5393 7.3123 2.5930 18.1878 0.4988 2.6714 2.1393 55.2108 1.8326 5.9993 69.7450 3.6630 13.8664 1.7922 9.1768 81.8031 1.4037 25.5810 0.8886 4.9891 3.5279 1.3461 0.6226 4.4420 4.2222 25.7551 2.2306 8.0024 6.4989 1.2321 17.3099 0.1226 0.4341 27.1249 10.5020 3.3447 1.0865 34.6756 55.5874 4.4806 65.3300 56.1650 266.6090 3.3762 5.7246 0.0555 0.2784 6.7600 1.3257 1.6979 19.4325 10.8522 8.5426 7.4804 1.4800 2.0915 0.6856 32.6002 4.7444 19.2378 0.8512 11.0303 6.2690 0.5975 110.7454 32.1579 8.6337 26.3335 1.1950 25.2005 1.0786 9.4158 12.0585 15.0655 9.6582 14.4884 4.5338 3.4805 6.4097 116.5472 23.8903 35.7023 29.2412 67.8435 26.1667 41.0362 42.1979 6.8920 7.9395 82.4664 13.6528 61.9088 51.4070 25.8144 16.7904 7.8788 6.1258 4.8690 2.1235 20.0675 25.8855 1.9718 20.9250 7.2355
temp: 298.150 k
press: 1.00000 atm
elementType: 8 8 6 6 6 6 6 6 6 6 6 6 6 6 6 6 6 6 6 6 6 1 1 1 1 1 1 1 1 1 1 1 1 1 1 1 1 1 1 1 1 1 1 1 1
symmnumber: 1
zpe: 1005047.1 jmol-1
zpe.correction: 0.382802 hartree
zpe.thermalcorrener: 0.402105 hartree
zpe.thermalcorrenthalpy: 0.403050 hartree
zpe.thermalcorrgfe: 0.333552 hartree
zpe.sumelectzpe: -887.273239 hartree
zpe.sumelectthermal: -887.253936 hartree
zpe.sumelectthermalent: -887.252992 hartree
zpe.sumelectthermalfe: -887.322490 hartree
dipole: -0.4008 0.6756 1.5513
dipole: 1.7388
quadrupole: -116.9874 -119.9467 -127.0998
quadrupole: 2.2538 3.0159 -3.0941
quadrupole: 4.3572 1.3980 -5.7552 2.2538 3.0159 -3.0941
hfenergy: -887.6560416 hartree
pointgroup: C01 [X(C19H24O2)]
dipole: 0.1277429 0.3997237 -0.5402837 debye
polarizability: 223.0833158|-12.7979482|188.9117331|13.6066964|9.9990201|182.2106368 unknown
InChI: InChI=1S/C19H24O2/c1-18(2)14-8-9-15(10-14)19(18)11-16(19)17(20)21-12-13-6-4-3-5-7-13/h3-7,14-16H,8-12H2,1-2H3
charge 0 multiplicity 1
45 atoms
O  -1.24563 -1.82617 -0.698356
O  -0.407014 -1.680437 1.482353
C  2.117896 -0.411827 0.000198
C  2.901784 0.446928 -1.073581
C  1.791056 0.564062 1.15153
C  1.085821 -1.499346 -0.45864
C  2.392211 -1.874134 0.275369
C  2.926288 1.852049 -0.347139
C  1.541425 1.882027 0.366407
C  3.12816 0.885548 1.893858
C  3.878168 1.832399 0.885134
C  4.313032 -0.117159 -1.369208
C  2.144461 0.583753 -2.4214
C  -0.21098 -1.668432 0.238553
C  -2.635984 -1.984982 -0.13647
C  -3.337165 -0.64961 -0.013205
C  -3.16973 0.144533 1.151538
C  -4.170013 -0.175468 -1.058175
C  -3.819828 1.393225 1.263278
C  -4.822092 1.073158 -0.946879
C  -4.647785 1.860572 0.215026
H  0.987821 0.213898 1.816244
H  1.033351 -1.694646 -1.531745
H  2.2763 -2.224709 1.306794
H  3.146237 -2.406541 -0.312543
H  3.131687 2.676257 -1.052159
H  0.675079 1.830813 -0.314571
H  1.424192 2.760586 1.026369
H  3.697965 -0.033893 2.119122
H  2.926487 1.39594 2.853143
H  3.971719 2.855057 1.295697
H  4.897232 1.486836 0.643671
H  4.861921 -0.376907 -0.447891
H  4.24818 -1.034475 -1.98503
H  4.916218 0.618384 -1.934558
H  2.081315 -0.384491 -2.951845
H  1.115187 0.958256 -2.285878
H  2.682119 1.286774 -3.085633
H  -2.548323 -2.491942 0.84001
H  -3.126753 -2.64013 -0.873296
H  -2.520801 -0.221165 1.955292
H  -4.30476 -0.784729 -1.96055
H  -3.685254 1.999148 2.166317
H  -5.465121 1.429435 -1.759534
H  -5.154986 2.828056 0.303682
