program: Gaussian 09
title: 000250452
version: EM64L-G09RevD.01
frameworkgroup: C1[X(C10H15Cl2N2O2P)]
method: RPBEPBE
basis: SDD
operation: Freq
keyword: #p
keyword: freq=noraman
keyword: PBEPBE/SDD
title: #p freq=noraman PBEPBE/SDD
converged: YES YES NO NO
title: Mulliken charges:
elementType: Cl Cl P O O N N C C C C C C C C C C H H H H H H H H H H H H H H H
charge: -0.055140 -0.056804 1.361572 -0.557482 -0.604009 -0.506758 -0.947587 -0.293938 -0.286456 -0.575302 -0.574813 0.354757 -0.357535 -0.380615 -0.209382 -0.201490 -0.246351 0.230527 0.278693 0.266508 0.239648 0.304924 0.257957 0.264257 0.292478 0.359295 0.379926 0.311690 0.251438 0.234439 0.232865 0.232687
chargesum: 0.00000
title: Mulliken charges with hydrogens summed into heavy atoms:
elementType: Cl Cl P O O N N C C C C C C C C C C
charge: -0.055140 -0.056804 1.361572 -0.557482 -0.604009 -0.506758 -0.208366 0.215283 0.219700 -0.012421 -0.018078 0.354757 -0.045845 -0.129177 0.025057 0.031375 -0.013664
polarizability: 1.72937930e+02 1.67776158e+01 1.74975765e+02 -1.94619848e+01 1.03331308e+01 1.49826218e+02
1716.lowfreq: -8.2546 -5.0362 -0.0020 -0.0016 -0.0014 9.5334 19.2151 26.1444 30.2451
frequency: 18.2447 26.0581 29.9294 42.3139 54.1450 66.8434 75.6375 94.6703 118.3437 145.2883 190.9185 200.8505 209.8143 215.8218 245.2115 262.2672 285.7977 314.3262 324.5104 366.1979 393.4582 412.9082 440.9777 469.4876 492.4359 509.2607 546.6122 605.3493 628.5158 660.2109 679.6108 697.5866 714.2126 764.8220 766.4508 784.6405 830.1844 843.7617 846.3389 920.3270 948.3332 972.7129 975.3123 985.6156 993.6482 998.0653 1022.1304 1039.5387 1045.6711 1049.8324 1065.7096 1078.4382 1121.2293 1166.8414 1175.0178 1193.0320 1205.8964 1230.5857 1254.3711 1261.5914 1295.2971 1313.8772 1331.5991 1357.5421 1366.3653 1378.5778 1440.9035 1446.0181 1453.6414 1456.8209 1469.8403 1472.7738 1558.5239 1591.4077 1602.3602 3002.2220 3014.7411 3058.1778 3062.2503 3071.6326 3082.6307 3131.9384 3140.3447 3147.1368 3151.1979 3153.7836 3161.0277 3172.2284 3545.6928 3693.7022
redmass: 8.5775 7.3905 3.7752 5.5030 5.9534 5.1964 2.8432 3.0116 6.0489 3.7139 3.7070 4.2175 4.1292 5.8091 5.4657 6.4205 5.8159 2.4493 2.4076 3.0623 3.4655 2.9817 4.5848 4.8381 3.4376 1.5003 5.3194 6.7921 7.2093 7.1101 5.7906 2.3312 3.7981 1.5149 1.1596 1.2332 6.7446 2.7364 1.6815 1.3939 2.9003 1.4730 1.3692 5.5472 1.3136 1.4691 2.0969 3.3460 2.6936 5.4581 1.9772 1.5600 1.5477 1.2366 1.3644 1.8175 2.5104 1.5672 1.2021 1.1631 1.1681 1.3307 1.1911 1.2173 1.2254 8.4331 2.2665 1.0773 1.0931 1.1011 1.0918 2.1128 1.1022 6.3743 6.1735 1.0615 1.0603 1.0576 1.0571 1.1005 1.1043 1.0851 1.0891 1.1123 1.1120 1.0931 1.0967 1.1015 1.0445 1.1025
irintensity: 0.0640 0.2397 0.7936 0.6225 0.4933 1.1424 4.1008 0.8545 6.2066 6.2207 1.3876 1.9718 3.4473 4.0105 3.1465 3.7290 0.7076 8.5269 23.8907 1.2373 46.2259 0.1536 46.1888 16.4369 53.6441 242.2272 11.4084 14.1738 9.1520 43.3370 86.9358 31.1134 86.7781 87.2446 11.5935 12.9391 158.7040 152.9311 64.2132 12.6170 112.2303 116.3985 6.1270 4.8024 4.0494 2.1297 13.0670 10.0902 14.1368 78.6477 46.7393 6.2166 39.5947 35.2445 54.2445 84.7554 72.4640 8.5465 11.8942 3.3364 4.6287 0.4160 9.9260 1.0070 0.7056 1.4921 6.3970 11.7649 8.0856 6.8728 9.7170 125.2765 82.7366 25.4568 42.9589 22.9615 20.5224 11.8373 18.8184 3.1595 1.6382 0.6002 11.5603 11.0517 11.0538 10.1365 14.5796 15.9341 75.1092 57.6683
temp: 298.150 k
press: 1.00000 atm
elementType: 17 17 15 8 8 7 7 6 6 6 6 6 6 6 6 6 6 1 1 1 1 1 1 1 1 1 1 1 1 1 1 1
symmnumber: 1
zpe: 641211.4 jmol-1
zpe.correction: 0.244225 hartree
zpe.thermalcorrener: 0.263554 hartree
zpe.thermalcorrenthalpy: 0.264498 hartree
zpe.thermalcorrgfe: 0.192764 hartree
zpe.sumelectzpe: -1910.050057 hartree
zpe.sumelectthermal: -1910.030728 hartree
zpe.sumelectthermalent: -1910.029784 hartree
zpe.sumelectthermalfe: -1910.101518 hartree
dipole: -0.7352 -2.3500 0.7650
dipole: 2.5784
quadrupole: -119.0028 -135.6119 -119.9470
quadrupole: -3.5735 -15.6673 -5.1931
quadrupole: 5.8511 -10.7580 4.9069 -3.5735 -15.6673 -5.1931
hfenergy: -1910.2942819 hartree
pointgroup: C01 [X(C10H15Cl2N2O2P1)]
dipole: -0.2689606 -0.3153223 -0.9259019 debye
polarizability: 166.5229341|10.9835112|159.0702226|-14.5258085|24.2384095|172.1467563 unknown
InChI: InChI=1S/C10H15Cl2N2O2P/c11-6-8-14(9-7-12)17(13,15)16-10-4-2-1-3-5-10/h1-5H,6-9,13H2
charge 0 multiplicity 1
32 atoms
Cl 2.997176 0.035973 3.312085
Cl 0.937431 -4.178648 -1.6435
P  0.947494 1.063195 -1.339326
O  -0.749369 0.5544 -1.366907
O  1.269282 2.413125 -0.55195
N  1.904976 -0.243203 -0.697792
N  1.074474 0.972735 -3.043717
C  2.6936 -0.010214 0.535938
C  1.900507 -1.57301 -1.343588
C  1.862984 -0.200207 1.818183
C  0.951517 -2.568311 -0.650808
C  -1.583746 0.577727 -0.216243
C  -1.505196 1.595801 0.764556
C  -2.54227 -0.45717 -0.126057
C  -2.403002 1.55572 1.855829
C  -3.439515 -0.471834 0.964836
C  -3.369821 0.529336 1.962376
H  3.548887 -0.710646 0.530081
H  3.089587 1.019956 0.522502
H  1.58663 -1.448127 -2.395124
H  2.930782 -1.976376 -1.347021
H  1.074287 0.560214 1.914011
H  1.444969 -1.2121 1.921733
H  1.283339 -2.855928 0.35737
H  -0.08664 -2.206534 -0.636238
H  1.943107 1.22884 -3.508916
H  0.217738 0.980348 -3.595988
H  -0.76894 2.4002 0.665457
H  -2.584977 -1.21805 -0.912111
H  -2.348671 2.339411 2.619524
H  -4.188966 -1.267871 1.034345
H  -4.063854 0.511653 2.809164
