program: Gaussian 09
title: 000255787
version: EM64L-G09RevD.01
frameworkgroup: C1[X(C12H28O4P2)]
method: RPBEPBE
basis: SDD
operation: Freq
keyword: #p
keyword: freq=noraman
keyword: PBEPBE/SDD
title: #p freq=noraman PBEPBE/SDD
converged: YES YES NO NO
title: Mulliken charges:
elementType: P P O O O O C C C C C C C C C C C C H H H H H H H H H H H H H H H H H H H H H H H H H H H H
charge: 1.196808 1.196808 -0.514304 -0.514304 -0.647803 -0.647802 -0.375801 -0.375801 -0.267774 -0.267774 -0.670417 -0.670411 -0.670418 -0.670409 -0.639927 -0.639925 -0.639927 -0.639924 0.213310 0.213292 0.213291 0.213311 0.195180 0.195211 0.195208 0.195183 0.263520 0.230372 0.230353 0.263533 0.263525 0.230367 0.230358 0.263528 0.233143 0.257626 0.221621 0.257613 0.233155 0.221624 0.233146 0.257625 0.221621 0.257615 0.233152 0.221623
chargesum: 0.00000
title: Mulliken charges with hydrogens summed into heavy atoms:
elementType: P P O O O O C C C C C C C C C C C C
charge: 1.196808 1.196808 -0.514304 -0.514304 -0.647803 -0.647802 0.050801 0.050801 0.122617 0.122617 -0.176524 -0.176526 -0.176527 -0.176523 0.072464 0.072467 0.072465 0.072466
polarizability: 2.31016175e+02 1.72653516e-03 1.98072813e+02 -5.16700467e+00 5.41409919e-04 1.60690582e+02
1716.lowfreq: 0.0003 0.0008 0.0012 3.1622 3.5742 11.5863 17.9779 24.0772 28.4639
frequency: 11.5862 24.0772 27.9505 37.2175 49.0870 52.4827 53.2125 58.8197 80.9787 93.3063 103.5201 107.6643 107.7274 115.3943 149.2616 151.0344 173.3387 180.7910 182.3450 192.9344 196.4441 196.9535 207.2536 255.2468 255.3223 271.3999 284.5847 301.9477 302.6484 324.8144 346.0038 411.3221 430.7325 434.7003 434.9285 584.2409 600.3427 660.7435 661.2095 668.3167 682.5083 752.6378 754.0319 755.8840 777.1715 778.9898 811.7918 929.1948 950.1825 971.5263 976.1509 976.4882 983.1457 983.1684 1003.4471 1003.5709 1012.3773 1012.4064 1035.2988 1035.4778 1044.6783 1048.9269 1060.7604 1062.2222 1076.5204 1080.4195 1103.1454 1124.5222 1158.5683 1234.0570 1234.4144 1241.8688 1252.0858 1252.8704 1254.1973 1263.5157 1263.5775 1277.0481 1277.1359 1281.3823 1288.4293 1326.6770 1367.8287 1371.7100 1398.9284 1398.9605 1400.3490 1400.4561 1427.9366 1427.9373 1437.6282 1437.9301 1470.2382 1470.2470 1470.3243 1470.3610 1470.9932 1471.0081 1479.3222 1486.8596 1486.9923 1486.9951 1489.5799 1492.2445 2928.8058 2929.0078 2980.7189 2981.4392 2992.3085 2992.3698 2992.6294 2992.8073 2992.9358 3001.0088 3002.7923 3002.8036 3006.4857 3006.5510 3043.9285 3062.3831 3062.4128 3065.9816 3065.9891 3071.9967 3089.7484 3089.7534 3089.9875 3090.0424 3098.7535 3098.7926 3099.6495 3099.7058
redmass: 3.6589 3.8210 3.3197 5.3890 2.9743 1.7568 3.1039 2.5690 2.9272 2.9672 2.2677 3.2591 2.4079 3.5279 2.2920 8.0352 1.7051 1.4757 1.4643 1.1830 3.7216 3.8440 1.9586 1.9026 1.9046 2.9780 3.8044 3.4675 2.9844 3.7707 4.0578 4.4046 3.8473 4.0694 4.0664 5.0582 4.2759 6.5171 6.5374 6.0471 5.9018 1.1223 1.1839 1.1257 1.2676 1.2759 1.1471 1.1968 9.5161 7.6336 2.0200 2.1406 1.4340 1.4357 1.1846 1.1849 2.3249 2.3145 2.7008 2.6940 3.5752 3.2908 2.0701 2.1999 2.3838 2.4452 2.9418 1.5186 1.1677 1.2371 1.2344 1.2643 1.2091 1.2001 1.2367 1.3746 1.3738 1.3321 1.3330 1.0554 1.1535 1.3029 1.3019 1.5056 1.1811 1.1813 1.1833 1.1831 1.0802 1.0801 1.0825 1.0834 1.0680 1.0370 1.0717 1.0366 1.0435 1.0366 1.0809 1.0614 1.0478 1.0478 1.0537 1.0794 1.0542 1.0536 1.1057 1.1058 1.0354 1.0353 1.0526 1.0353 1.0426 1.0586 1.0586 1.0587 1.0589 1.0589 1.1033 1.1026 1.1026 1.1023 1.1023 1.1051 1.1006 1.1006 1.1005 1.1005 1.1009 1.1009 1.1009 1.1009
irintensity: 1.2330 3.2028 0.0002 8.7679 0.0055 0.0002 2.8410 0.0664 0.0000 0.0003 2.2674 2.5131 1.1556 0.0000 0.0000 0.0000 0.1910 3.3272 0.0001 0.0477 51.0291 0.0005 8.0240 0.0000 0.0003 12.4052 0.0000 3.6340 0.0000 0.0000 5.7919 22.7130 0.0000 0.0000 48.9048 0.0000 11.8298 0.0001 144.4823 0.0001 225.7045 0.6460 0.0002 5.2392 121.9991 0.0001 0.0002 0.1308 347.8438 0.0001 84.5480 0.0002 0.0008 14.3554 0.0001 2.9120 16.0781 0.0000 0.0003 75.9397 0.0000 146.3756 0.0000 3.2498 0.0000 58.0228 0.0000 0.0000 3.8259 0.0000 0.9062 0.0002 3.4684 0.0000 30.9384 1.8395 0.0000 0.0000 4.4798 0.0000 1.7314 0.0000 25.3419 0.0000 0.0129 44.5395 19.3789 0.0161 0.9448 0.0106 45.3763 0.0000 0.0001 0.5741 21.7981 0.3684 32.9230 0.0029 0.0000 54.2697 0.5887 8.9539 0.0002 0.7678 0.0041 76.7879 76.9129 0.0003 0.0037 102.3073 0.0274 5.3334 0.0125 37.9293 0.2567 0.0012 0.0086 66.5759 0.0000 0.1067 0.0000 16.6900 0.0092 75.0585 0.1938 25.7944 77.2169 0.0065 0.0158 0.5107 91.9770 0.0665
temp: 298.150 k
press: 1.00000 atm
elementType: 15 15 8 8 8 8 6 6 6 6 6 6 6 6 6 6 6 6 1 1 1 1 1 1 1 1 1 1 1 1 1 1 1 1 1 1 1 1 1 1 1 1 1 1 1 1
symmnumber: 1
zpe: 1022334.5 jmol-1
zpe.correction: 0.389387 hartree
zpe.thermalcorrener: 0.415781 hartree
zpe.thermalcorrenthalpy: 0.416725 hartree
zpe.thermalcorrgfe: 0.328475 hartree
zpe.sumelectzpe: -1455.883769 hartree
zpe.sumelectthermal: -1455.857375 hartree
zpe.sumelectthermalent: -1455.856431 hartree
zpe.sumelectthermalfe: -1455.944681 hartree
dipole: 0.0000 -0.0064 0.0000
dipole: 0.0064
quadrupole: -160.1608 -116.0032 -138.8068
quadrupole: 0.0018 54.2514 -0.0005
quadrupole: -21.8372 22.3204 -0.4832 0.0018 54.2514 -0.0005
hfenergy: -1456.2731557 hartree
pointgroup: C01 [X(C12H28O4P2)]
dipole: 0.0000005 0.0025066 -0.0000031 debye
polarizability: 231.0803994|0.0194303|198.0728198|4.7091729|0.0157409|160.6263507 unknown
InChI: InChI=1S/C12H28O4P2/c1-5-17(13,6-2)15-11-9-10-12-16-18(14,7-3)8-4/h5-12H2,1-4H3
charge 0 multiplicity 1
46 atoms
P  4.720344 -0.008605 0.123902
P  -4.72032 -0.013999 -0.123933
O  3.024188 -0.009129 0.645711
O  -3.024166 -0.012181 -0.645743
O  5.677616 -0.009495 1.404856
O  -5.677592 -0.015027 -1.404886
C  0.620495 -0.009456 0.461407
C  -0.620473 -0.009744 -0.461439
C  1.927682 -0.008211 -0.339283
C  -1.92766 -0.010804 0.339251
C  4.881029 1.529376 -0.960739
C  4.881069 -1.545003 -0.962965
C  -4.882725 1.523016 0.961817
C  -4.879326 -1.551361 0.961827
C  4.662699 2.810555 -0.131152
C  4.662217 -2.827389 -0.135377
C  -4.665644 2.805024 0.133183
C  -4.659233 -2.832919 0.133285
H  0.617414 -0.898335 1.120882
H  0.616368 0.878663 1.121894
H  -0.617377 0.879001 -1.121089
H  -0.616361 -0.897996 -1.121752
H  1.982677 -0.908791 -0.989182
H  1.982252 0.893844 -0.987165
H  -1.983329 0.8906 0.98795
H  -1.981556 -0.912036 0.988334
H  5.900598 1.503081 -1.388346
H  4.163197 1.452205 -1.798284
H  4.163459 -1.466385 -1.800562
H  5.900754 -1.51827 -1.390267
H  -5.902308 1.495344 1.389303
H  -4.164892 1.445969 1.799373
H  -4.161712 -1.47262 1.79941
H  -5.898993 -1.526001 1.389255
H  3.642496 2.846985 0.290177
H  5.373302 2.85138 0.712512
H  4.813044 3.706799 -0.758862
H  5.372683 -2.869755 0.708326
H  3.64194 -2.864131 0.285744
H  4.812366 -3.722712 -0.764447
H  -3.645447 2.842802 -0.288041
H  -5.376223 2.84573 -0.710506
H  -4.816958 3.700656 0.761534
H  -5.369725 -2.8754 -0.71039
H  -3.638953 -2.868318 -0.287943
H  -4.808415 -3.728852 0.761717
