program: Gaussian 09
title: 000250446
version: EM64L-G09RevD.01
frameworkgroup: C1[X(C15H25N3O)]
method: RPBEPBE
basis: SDD
operation: Freq
keyword: #p
keyword: freq=noraman
keyword: PBEPBE/SDD
title: #p freq=noraman PBEPBE/SDD
converged: YES YES NO NO
title: Mulliken charges:
elementType: O N N N C C C C C C C C C C C C C C C H H H H H H H H H H H H H H H H H H H H H H H H H
charge: -0.298400 -0.102807 -0.413512 -0.501697 -0.372794 -0.353515 -0.323990 -0.322886 -0.385601 -0.673466 -0.690062 0.286489 0.309931 0.272881 -0.339616 -0.386363 -0.850458 -0.234182 -0.255428 0.231504 0.186098 0.179902 0.203572 0.187098 0.198860 0.189017 0.195626 0.275679 0.214025 0.202080 0.211316 0.224398 0.190290 0.273527 0.213426 0.274659 0.308301 0.306034 0.224566 0.246908 0.224822 0.224779 0.224443 0.224542
chargesum: 0.00000
title: Mulliken charges with hydrogens summed into heavy atoms:
elementType: O N N N C C C C C C C C C C C C C C C
charge: -0.298400 -0.102807 -0.138853 -0.193396 0.044808 0.029960 0.061968 0.061758 0.104103 -0.035671 -0.012818 0.286489 0.309931 0.272881 -0.033582 -0.161797 -0.153949 -0.009739 -0.030886
polarizability: 2.58641349e+02 -1.71649172e+01 2.00634030e+02 -1.76920264e+01 -7.41295226e+00 1.24029776e+02
1716.lowfreq: -0.0004 -0.0003 0.0002 2.4609 6.5050 11.7802 15.1559 25.4108 30.5829
frequency: 15.1132 25.3638 30.5430 49.2540 57.7952 74.4202 80.8594 98.9687 109.8454 131.3130 167.4885 188.2509 197.1661 207.3109 217.1620 255.9862 263.1733 276.3686 291.5056 307.0989 339.8843 347.8389 363.7649 419.1240 427.1225 442.9429 450.7568 461.1711 492.8795 529.8972 539.1688 582.6886 603.1740 698.5014 704.3930 706.4744 727.1027 763.8418 774.2319 790.1399 792.1365 822.2085 857.7550 864.4429 879.0527 888.9741 926.5239 949.1201 977.9476 979.9904 993.9128 1006.8595 1041.6121 1045.9091 1049.9596 1071.5957 1077.3868 1079.7585 1087.9522 1097.2121 1113.8748 1126.5307 1160.0689 1172.6123 1190.6842 1196.0646 1208.3475 1231.0305 1252.3703 1275.5171 1280.6851 1292.3505 1298.1763 1300.8705 1341.1556 1349.0106 1360.1976 1364.9896 1373.7419 1376.6180 1386.5469 1393.7994 1399.6404 1440.0134 1446.2230 1453.5854 1460.6984 1465.4364 1467.2244 1473.6458 1480.4479 1481.3183 1483.3480 1487.4996 1489.8369 1494.0073 1498.5106 1518.8456 1595.2337 1620.1761 1646.4362 2845.8752 2853.4990 2869.2037 2946.3139 2971.8659 2980.2376 2981.6719 2989.7545 3012.8276 3017.7197 3028.5668 3030.5443 3044.8883 3074.2429 3074.7799 3082.4709 3085.0610 3089.3461 3094.7733 3119.1102 3134.4500 3159.0167 3192.3801 3532.0884 3543.3677
redmass: 3.6022 4.0786 4.2521 3.6305 5.1069 2.6953 3.3631 3.0662 2.3603 3.2154 2.9523 1.7329 1.0816 1.7446 1.2725 3.2038 2.2078 2.6821 2.7226 2.0746 4.0661 2.0730 1.5270 3.1783 2.5930 2.9063 2.0568 2.5568 2.5625 4.4215 2.5850 1.3816 5.8279 7.0689 3.1346 5.1489 3.0157 1.3302 4.1942 1.1880 1.1723 3.4618 2.9273 1.9997 1.3034 2.0695 2.0953 1.3653 1.6429 2.3596 1.2997 2.2193 1.5177 2.1874 2.3649 2.2965 2.5454 2.0095 2.0476 2.7980 1.8549 1.9307 1.7074 1.0948 1.5595 1.9075 1.9494 1.8143 1.3862 1.9756 1.1474 1.2296 1.2452 1.7036 1.3924 1.3357 1.3239 1.3471 2.6340 1.7775 1.2339 1.2756 1.2148 2.3489 1.1234 1.7105 1.0521 1.0588 1.0920 1.0611 1.0870 1.0501 1.0670 1.3378 1.0969 1.0871 1.6669 2.1192 6.0599 5.8724 3.9694 1.0721 1.0718 1.0714 1.0401 1.0629 1.0370 1.0359 1.0683 1.0978 1.0862 1.0898 1.0901 1.0924 1.0981 1.0983 1.0963 1.0941 1.1003 1.0999 1.0871 1.0899 1.0985 1.0948 1.0768 1.0753
irintensity: 1.0678 0.3427 0.4044 1.9930 8.0880 0.3485 1.4365 1.0468 1.3207 4.5682 0.3356 2.1172 0.8297 3.2810 4.0710 0.1376 2.3180 1.5697 4.0581 0.4600 8.5127 8.9087 17.9368 0.9423 6.2841 8.4812 5.5883 4.4326 6.2856 4.6610 42.6031 129.6828 1.2833 10.1627 1.8801 6.9855 3.1568 91.9560 1.8979 5.0734 5.3095 0.5394 7.3010 4.0120 3.1000 2.4541 2.6759 3.7480 5.0164 5.1033 2.5270 6.2415 6.5092 19.7930 19.1383 5.6167 8.2675 28.4381 2.4459 42.0346 5.5945 7.0770 6.2065 1.2120 13.9917 24.3176 108.3170 318.9413 5.7329 15.5041 12.7103 10.4729 29.1712 63.2588 12.6701 1.5385 3.7673 4.7322 59.2597 26.3659 22.2708 25.4552 14.7032 70.8789 51.2216 65.6938 7.6058 1.2925 35.3867 2.5341 44.6376 11.7235 4.9559 175.5328 8.0291 22.1048 131.4209 477.0813 83.1612 12.1624 132.6867 36.0526 68.5718 213.4361 38.4454 51.9998 31.3064 39.5438 65.9314 26.6320 17.8280 40.0588 13.3140 77.9360 67.5763 25.8008 3.2733 18.7661 44.8386 17.7648 10.0003 20.9470 29.9337 10.8177 14.3829 17.2683
temp: 298.150 k
press: 1.00000 atm
elementType: 8 7 7 7 6 6 6 6 6 6 6 6 6 6 6 6 6 6 6 1 1 1 1 1 1 1 1 1 1 1 1 1 1 1 1 1 1 1 1 1 1 1 1 1
symmnumber: 1
zpe: 998294.6 jmol-1
zpe.correction: 0.380230 hartree
zpe.thermalcorrener: 0.401508 hartree
zpe.thermalcorrenthalpy: 0.402452 hartree
zpe.thermalcorrgfe: 0.327782 hartree
zpe.sumelectzpe: -824.600732 hartree
zpe.sumelectthermal: -824.579454 hartree
zpe.sumelectthermalent: -824.578510 hartree
zpe.sumelectthermalfe: -824.653180 hartree
dipole: -0.1188 -4.5867 1.7473
dipole: 4.9097
quadrupole: -107.5180 -103.1064 -121.8222
quadrupole: 3.8789 -0.9084 0.4857
quadrupole: 3.2975 7.7091 -11.0066 3.8789 -0.9084 0.4857
hfenergy: -824.9809619 hartree
pointgroup: C01 [X(C15H25N3O1)]
dipole: 0.1536468 -1.8004652 0.682561 debye
polarizability: 258.2802101|-12.5812919|198.0935767|-25.9259078|-8.238545|126.9313674 unknown
InChI: InChI=1S/C15H25N3O/c1-4-18(5-2)12-8-11-16-15(19)17-14-10-7-6-9-13(14)3/h6-7,9-10,16-17H,4-5,8,11-12H2,1-3H3
charge 0 multiplicity 1
44 atoms
O  -0.232817 0.508307 -0.771979
N  3.896928 0.612401 0.249463
N  0.412716 -1.71998 -0.477752
N  -1.782233 -1.09239 0.031872
C  3.031848 -0.367924 0.960596
C  2.850907 -1.675606 0.152912
C  5.343618 0.294132 0.397823
C  3.580728 2.026186 0.611678
C  1.791839 -1.545355 -0.969386
C  6.203348 0.864535 -0.746545
C  2.396485 2.599747 -0.188389
C  -0.516826 -0.6798 -0.430726
C  -2.944494 -0.298954 0.246756
C  -4.106298 -0.965418 0.756114
C  -2.980929 1.095134 -0.022719
C  -5.275405 -0.203653 0.981345
C  -4.092401 -2.457413 1.050783
C  -4.164799 1.824062 0.215367
C  -5.319072 1.18416 0.717878
H  2.038969 0.092928 1.115097
H  3.437534 -0.603283 1.977396
H  2.566057 -2.504932 0.833594
H  3.818292 -1.960869 -0.303297
H  5.739789 0.649088 1.384153
H  5.453131 -0.806882 0.401865
H  3.382991 2.119436 1.70914
H  4.479133 2.638146 0.408558
H  1.858381 -0.541787 -1.422814
H  1.981409 -2.292292 -1.765248
H  7.266132 0.588952 -0.609318
H  6.146007 1.967029 -0.793395
H  5.854569 0.46836 -1.716264
H  2.162469 3.626217 0.154336
H  1.485815 1.984716 -0.089442
H  2.648588 2.637229 -1.263159
H  0.152721 -2.650914 -0.146848
H  -1.895324 -2.085548 0.239603
H  -2.085823 1.58071 -0.414844
H  -6.166091 -0.711411 1.371369
H  -5.072334 -2.785333 1.434875
H  -3.884518 -3.063578 0.144622
H  -3.339216 -2.72732 1.819754
H  -4.179476 2.899042 0.002971
H  -6.237549 1.751722 0.901306
