program: Gaussian 09
title: 000255925
version: EM64L-G09RevD.01
frameworkgroup: C1[X(C21H24O9S2)]
method: RPBEPBE
basis: SDD
operation: Freq
keyword: #p
keyword: freq=noraman
keyword: PBEPBE/SDD
title: #p freq=noraman PBEPBE/SDD
converged: YES YES NO NO
title: Mulliken charges:
elementType: S S O O O O O O O O O C C C C C C C C C C C C C C C C C C C C C H H H H H H H H H H H H H H H H H H H H H H H H
charge: 0.953074 0.960669 -0.250674 -0.255323 -0.403901 -0.416462 -0.268185 -0.491620 -0.514678 -0.507742 -0.490596 -0.188184 -0.088387 -0.178554 -0.017500 -0.346883 -0.012278 -0.515324 -0.025744 -0.016639 -0.270793 -0.191896 -0.194504 -0.277435 -0.386524 -0.352474 0.455052 -0.367094 -0.369663 0.455569 -0.799289 -0.797911 0.320759 0.260504 0.313047 0.302090 0.229269 0.233542 0.226742 0.235088 0.234043 0.216290 0.289382 0.325627 0.296866 0.291392 0.246367 0.243045 0.246700 0.246697 0.228749 0.245385 0.232576 0.232166 0.230341 0.245225
chargesum: 0.00000
title: Mulliken charges with hydrogens summed into heavy atoms:
elementType: S S O O O O O O O O O C C C C C C C C C C C C C C C C C C C C C
charge: 0.953074 0.960669 -0.250674 -0.255323 -0.403901 -0.416462 -0.268185 -0.491620 -0.514678 -0.507742 -0.490596 0.132575 0.172117 0.134493 0.284590 0.115928 0.214464 0.170097 -0.025744 -0.016639 0.018589 0.133731 0.102362 0.013957 -0.140158 -0.109429 0.455052 -0.120394 -0.122966 0.455569 -0.092578 -0.090179
polarizability: 4.17036715e+02 -2.72614560e+01 3.18636528e+02 2.96699619e+01 4.44416855e+00 2.35818494e+02
1716.lowfreq: -8.2135 -5.0956 -0.0015 -0.0014 -0.0012 3.5093 4.8377 11.9097 15.1065
frequency: -6.5228 11.5062 14.2280 24.0480 27.0313 31.5660 32.9960 37.8467 45.6321 53.2643 62.3021 79.8674 82.2486 108.7263 112.3345 126.1962 138.5907 144.9889 146.8055 155.0936 164.3818 176.5540 195.1967 208.1217 217.0685 224.3549 241.1725 250.5681 266.8037 272.4080 276.3480 317.3092 320.4805 347.4135 357.9768 367.8293 383.4634 387.9186 404.7335 405.9440 412.3131 421.0749 436.2297 453.5122 473.2438 495.1515 498.8798 533.7101 545.0941 548.7550 572.8805 591.3983 595.7184 614.7093 620.7508 621.5084 699.3375 702.4978 727.8390 776.0074 776.4614 778.0629 804.8983 817.5750 820.9532 826.6389 833.6929 834.3416 843.7986 849.8043 876.3983 886.3744 902.9952 935.1044 950.4164 954.2491 955.8678 958.6866 965.7734 980.1482 985.3518 985.7498 988.0765 989.5852 993.5201 993.6536 1015.9315 1024.5517 1037.4876 1049.4282 1049.7018 1049.9580 1052.5924 1074.2628 1094.5544 1110.3269 1114.2642 1123.7903 1125.6723 1150.7097 1158.1719 1178.8199 1190.9678 1193.7535 1219.6871 1220.5209 1230.4060 1242.4351 1267.4139 1284.0484 1296.0259 1302.4758 1305.6353 1314.6467 1325.8893 1330.7570 1345.6976 1359.5047 1381.7362 1381.7625 1392.2291 1393.1275 1398.8600 1399.9586 1434.1578 1458.7899 1470.2218 1470.7928 1472.2472 1473.2551 1474.1177 1474.8302 1475.6513 1478.0142 1590.8376 1592.2093 1593.0333 1593.4724 2951.6245 2963.8123 2981.5318 2982.0272 3009.5666 3018.5533 3042.0625 3060.0354 3063.4271 3064.2059 3072.7267 3092.7580 3093.8143 3114.3773 3122.1060 3129.6171 3130.5233 3139.4786 3140.4930 3140.9530 3147.8956 3164.6311 3167.1595 3167.6919
redmass: 5.5305 5.9628 5.4451 1.0557 4.5281 1.0373 4.6578 4.1695 4.9259 4.8611 6.1631 3.4894 5.7651 4.5851 6.2094 3.4441 2.7196 4.6487 3.7667 3.9988 5.2341 7.6410 5.3770 6.0198 6.8122 6.8004 7.2960 7.1822 5.6092 6.3963 5.5625 4.1389 4.3632 5.1204 4.4997 4.5632 4.1415 6.5259 2.9182 2.9213 6.2298 9.4802 10.5032 7.6826 4.7429 3.2070 3.3072 4.7115 6.4130 6.7663 7.3669 6.2164 7.0655 6.0348 7.0303 6.9639 3.4022 3.2914 5.2932 5.1617 5.0470 4.9461 3.8950 4.6491 1.3853 1.4145 8.9644 9.2334 1.2895 1.2531 4.8203 3.6246 4.0201 5.1074 4.9239 10.6909 7.1033 1.4153 1.3020 1.3748 2.5722 3.3851 1.3973 2.6161 2.0296 2.0189 3.1586 2.8231 5.7737 1.6891 1.6036 2.2728 2.4782 2.0653 2.9609 2.8258 1.2588 1.3015 1.3181 1.2715 1.6208 1.6787 1.1271 1.1326 3.0892 3.1028 1.5394 1.3571 1.2664 1.2377 1.2282 1.2579 1.2558 1.2073 1.2581 1.3524 1.2482 1.3781 5.6197 6.3739 2.8596 2.6039 1.3107 1.2246 1.1625 1.0512 1.0646 1.1094 1.6590 1.8116 1.2856 1.1997 1.0849 1.0787 6.5662 6.0809 5.9551 6.8736 1.0825 1.0343 1.0390 1.0381 1.0592 1.0845 1.0844 1.1018 1.0960 1.0948 1.1085 1.0996 1.1001 1.0898 1.1014 1.0903 1.0909 1.0893 1.0897 1.0895 1.0968 1.0958 1.0974 1.0962
irintensity: 1.5989 2.5516 0.2546 0.2616 0.4739 0.6429 1.1683 0.1476 0.8186 0.8533 0.2700 3.3465 0.9190 3.8965 0.2813 1.9728 2.7054 4.7607 3.0473 2.8113 2.4870 4.9194 3.1486 9.9884 19.4782 10.2029 2.6651 1.8522 14.0238 0.1664 3.4132 6.9768 4.0986 1.2562 10.5915 3.1371 3.8606 11.5076 0.2229 0.5328 8.0509 68.9452 114.0691 28.2228 4.2918 22.2722 33.1593 57.4258 56.2017 21.6215 16.2367 77.5129 17.6960 49.4032 7.2039 19.1517 1.5755 1.3311 10.0144 2.7579 16.8073 3.8163 19.0749 56.5116 56.0091 67.7238 69.1762 73.7045 1.3921 1.2910 93.6446 92.3182 38.1034 8.3223 12.6558 102.0038 80.7978 10.6686 1.6463 0.6902 2.3251 54.3716 0.3153 6.1003 2.5590 4.8262 14.1242 95.6719 87.2787 11.5737 23.8385 20.2522 20.9993 37.9675 61.4337 53.0347 0.5942 6.2907 8.2167 8.7811 14.1402 14.6994 13.0697 11.2002 6.9902 4.2008 11.7006 23.3228 9.9191 6.6533 7.4189 2.0682 2.1706 5.5128 8.5997 2.6771 7.9815 19.9456 3.3469 1.0016 12.0224 16.8801 14.8882 16.8545 7.7730 12.8728 15.1861 18.5912 23.0302 22.6255 13.1177 15.3018 19.3937 2.3789 11.4572 7.4082 15.1544 1.2879 31.4512 67.2257 24.0189 21.8796 50.8834 32.6759 16.7991 41.2648 17.9632 17.8146 23.1392 16.8306 14.5681 1.1853 17.2952 19.9150 25.4657 13.6652 8.0888 4.9324 19.5421 0.1530 16.2209 7.8963
temp: 298.150 k
press: 1.00000 atm
elementType: 16 16 8 8 8 8 8 8 8 8 8 6 6 6 6 6 6 6 6 6 6 6 6 6 6 6 6 6 6 6 6 6 1 1 1 1 1 1 1 1 1 1 1 1 1 1 1 1 1 1 1 1 1 1 1 1
symmnumber: 1
zpe: 1096081.8 jmol-1
zpe.correction: 0.417476 hartree
zpe.thermalcorrener: 0.450061 hartree
zpe.thermalcorrenthalpy: 0.451005 hartree
zpe.thermalcorrgfe: 0.348482 hartree
zpe.sumelectzpe: -2284.984886 hartree
zpe.sumelectthermal: -2284.952300 hartree
zpe.sumelectthermalent: -2284.951356 hartree
zpe.sumelectthermalfe: -2285.053880 hartree
dipole: 3.7712 1.8073 5.4447
dipole: 6.8653
quadrupole: -145.4193 -199.5274 -205.4261
quadrupole: -31.3235 1.5250 0.0761
quadrupole: 38.0383 -16.0698 -21.9685 -31.3235 1.5250 0.0761
hfenergy: -2285.4023612 hartree
pointgroup: C01 [X(C21H24O9S2)]
dipole: -1.4295331 -0.1594809 2.2861646 debye
polarizability: 420.0022681|-28.3347188|305.5968525|-22.6106287|-27.0462153|245.8926172 unknown
InChI: InChI=1S/C21H24O9S2/c1-13-4-8-15(9-5-13)31(22,23)29-18-17-12-27-19(18)20(21(26-3)28-17)30-32(24,25)16-10-6-14(2)7-11-16/h4-11,17-21H,12H2,1-3H3
charge 0 multiplicity 1
56 atoms
S  3.54755 1.55527 -1.580437
S  -2.480842 -1.746029 -0.727117
O  -1.454233 2.32578 -0.283138
O  1.137743 1.60601 1.387361
O  1.758289 0.921703 -1.314838
O  -1.765462 -0.505056 0.4995
O  0.70255 -0.559205 2.173664
O  3.922596 1.563738 -3.153045
O  3.692985 2.938781 -0.740998
O  -1.964476 -1.30489 -2.202886
O  -2.252891 -3.269476 -0.237227
C  -0.608695 1.242797 -0.84898
C  0.767694 1.941755 -1.032487
C  0.861264 2.632659 0.365376
C  -0.453769 0.066585 0.146009
C  -0.547075 3.242338 0.489327
C  0.090076 0.545772 1.515966
C  0.845343 -0.377256 3.628569
C  4.368241 0.089892 -0.748415
C  -4.264605 -1.257143 -0.415041
C  5.388936 -0.560209 -1.459083
C  3.931648 -0.286706 0.532362
C  -4.636482 0.086409 -0.587187
C  -5.154138 -2.274061 -0.036892
C  6.025883 -1.649665 -0.824373
C  4.583881 -1.383705 1.133299
C  5.63577 -2.075629 0.472364
C  -5.993621 0.412942 -0.379741
C  -6.506103 -1.916335 0.161161
C  -6.945462 -0.577672 -0.013166
C  6.304027 -3.267202 1.132138
C  -8.406307 -0.212142 0.171355
H  -1.07923 0.90973 -1.783889
H  0.711968 2.698339 -1.838484
H  1.681719 3.356274 0.451113
H  0.229716 -0.692999 -0.276498
H  -0.89056 3.29663 1.537214
H  -0.601052 4.24592 0.029599
H  -0.748308 0.962595 2.116105
H  1.275254 -1.318254 4.003139
H  1.517939 0.469199 3.858373
H  -0.144336 -0.209786 4.098313
H  5.668572 -0.234783 -2.465823
H  3.099389 0.227101 1.02694
H  -3.899378 0.854779 -0.84005
H  -4.800597 -3.300545 0.102404
H  6.830693 -2.176469 -1.348823
H  4.257676 -1.712811 2.126427
H  -6.314447 1.454108 -0.497409
H  -7.225398 -2.688366 0.45645
H  7.244339 -3.540159 0.624265
H  5.640704 -4.152841 1.105474
H  6.533131 -3.064683 2.193655
H  -8.521346 0.803972 0.587071
H  -8.921098 -0.919713 0.843528
H  -8.939561 -0.231189 -0.798792
