program: Gaussian 09
title: 000255757
version: EM64L-G09RevD.01
frameworkgroup: C1[X(C14H22N4O2S)]
method: RPBEPBE
basis: SDD
operation: Freq
keyword: #p
keyword: freq=noraman
keyword: PBEPBE/SDD
title: #p freq=noraman PBEPBE/SDD
converged: YES YES NO NO
title: Mulliken charges:
elementType: S O O N N N N C C C C C C C C C C C C C C H H H H H H H H H H H H H H H H H H H H H H
charge: 0.236075 -0.274769 -0.263196 -0.153741 -0.165635 -0.041191 -0.403292 -0.372546 -0.367027 -0.354615 -0.352246 -0.647853 -0.355525 0.122207 0.113946 -0.159099 0.120407 -0.694643 -0.644766 0.167886 -0.613878 0.197198 0.196742 0.192216 0.190655 0.213358 0.215946 0.189146 0.188761 0.288348 0.283936 0.195395 0.195866 0.210330 0.210209 0.217261 0.247536 0.247296 0.298147 0.362733 0.245458 0.245311 0.271655
chargesum: 0.00000
title: Mulliken charges with hydrogens summed into heavy atoms:
elementType: S O O N N N N C C C C C C C C C C C C C C
charge: 0.236075 -0.274769 -0.263196 -0.153741 -0.165635 -0.041191 -0.040559 0.021394 0.015843 0.074688 0.025661 -0.075568 0.035736 0.122207 0.113946 -0.159099 0.120407 -0.056843 0.148213 0.167886 0.148545
polarizability: 3.10969519e+02 5.43309035e+00 2.19306135e+02 8.44103807e-01 -9.81230258e-02 1.18481159e+02
1716.lowfreq: -3.6336 -0.0012 0.0004 0.0015 4.4444 7.8227 13.7060 25.8397 38.6544
frequency: 13.1414 25.8071 38.4827 48.2477 74.2989 75.5337 78.8526 85.8702 89.5055 102.1891 118.0021 121.5368 130.5364 142.9169 146.4417 161.6351 186.0550 220.6184 228.5659 234.3246 257.7907 260.4290 290.1918 314.5749 361.5906 368.5117 387.9423 419.5914 420.2214 464.0189 476.3796 531.4130 616.8063 633.1459 657.0035 671.4345 695.2436 696.3559 709.2946 724.4368 725.6231 735.5168 758.4709 760.5020 764.9279 819.2267 889.1743 903.3782 922.6991 989.8828 997.5620 1014.0927 1023.1589 1050.9177 1073.5459 1075.0351 1081.8919 1108.2161 1113.8200 1119.3391 1128.4883 1132.6672 1169.4983 1187.6238 1192.1817 1219.5448 1226.2671 1254.9740 1264.9310 1266.2754 1282.8565 1288.1158 1292.9209 1295.3977 1296.1465 1323.6406 1335.3717 1346.0567 1352.9586 1356.1999 1356.5264 1388.2301 1391.5251 1423.3964 1445.5959 1454.7593 1464.3896 1464.4767 1470.1216 1473.9443 1476.6381 1477.6601 1477.7095 1483.3520 1484.5699 1485.3227 1489.8767 1504.8374 1570.5132 1640.9665 1660.8689 2954.0658 2957.4807 2964.5465 2970.4016 2973.4387 2981.1504 2989.9698 2992.4158 3002.1369 3006.6851 3017.7805 3033.8369 3043.1555 3048.7312 3069.8764 3072.6426 3083.5303 3096.2444 3117.1258 3123.3839 3136.6155 3532.7404
redmass: 5.6393 5.0853 2.6006 2.0795 1.7244 2.5726 3.3842 2.2513 1.4027 2.9827 2.1346 2.1317 1.8016 5.2595 2.1311 4.2297 7.1174 3.4309 1.1275 6.2336 5.9011 3.9872 4.9303 3.2320 7.5758 8.3781 6.9490 5.1152 5.0661 3.8832 5.6331 7.1660 4.3252 9.3393 4.4091 6.6113 5.5021 6.6266 4.8572 3.6581 1.0634 1.0832 2.8953 1.1473 6.1715 1.1963 1.8906 1.2183 3.3195 1.1834 4.3658 4.3131 3.3868 3.2273 1.4634 1.5869 2.3153 1.9641 3.9691 2.8489 1.3026 1.2964 5.2109 1.7455 3.1609 1.2522 1.3943 1.2681 1.2514 6.6407 1.0360 5.0098 1.1434 1.3542 1.0921 5.3672 1.6250 3.6400 1.5744 1.7637 1.6681 3.0352 1.2169 1.2887 1.0970 1.6865 1.0729 1.0696 1.0728 1.3272 1.0656 1.0509 1.0428 1.0902 1.0847 1.0492 1.0946 2.5208 8.1630 8.5900 6.5512 1.0589 1.0589 1.0591 1.0589 1.0366 1.0591 1.0974 1.0334 1.1001 1.0334 1.1029 1.1043 1.0575 1.1044 1.1007 1.0993 1.1025 1.1025 1.1027 1.1091 1.1013 1.0769
irintensity: 0.2275 0.2782 0.1860 0.0168 0.0137 0.2962 0.1837 3.2544 0.0596 3.0124 1.2889 0.1533 0.1145 1.1568 0.2630 0.4513 10.7380 15.0755 0.0021 0.3038 1.4177 0.3528 0.8793 3.5750 5.3694 0.6624 10.3254 0.1821 17.2166 6.3017 14.8908 15.2187 3.4620 0.2526 12.4010 31.9386 1.8174 3.3639 4.0539 20.7186 13.4238 0.7507 96.3797 10.8448 12.3362 0.1159 4.8427 1.2586 4.2117 0.2795 3.3583 4.5324 0.9018 6.5003 1.8935 1.5775 0.6206 108.6528 13.4981 27.1955 0.5991 0.2750 9.4864 0.0471 49.3119 1.6568 0.4039 27.3257 0.7166 34.6019 0.3679 3.8583 0.5421 42.0088 2.4108 171.5039 13.2022 152.7640 5.8928 31.8265 0.3598 67.4671 10.8528 19.5053 26.9069 96.6157 0.2746 1.4437 2.0089 85.8994 4.8066 8.1658 21.3839 49.4195 1.2082 31.2919 27.2204 70.6543 36.8279 654.9422 682.6838 0.3913 2.9795 4.4757 100.2850 37.5695 53.5579 0.0550 32.8780 0.0744 30.7239 0.1586 21.5922 9.4270 100.0829 95.0519 54.2570 15.6458 19.3216 1.0334 15.1284 0.5504 80.8872
temp: 298.150 k
press: 1.00000 atm
elementType: 16 8 8 7 7 7 7 6 6 6 6 6 6 6 6 6 6 6 6 6 6 1 1 1 1 1 1 1 1 1 1 1 1 1 1 1 1 1 1 1 1 1 1
symmnumber: 1
zpe: 925139.6 jmol-1
zpe.correction: 0.352367 hartree
zpe.thermalcorrener: 0.375912 hartree
zpe.thermalcorrenthalpy: 0.376856 hartree
zpe.thermalcorrgfe: 0.296006 hartree
zpe.sumelectzpe: -1312.642493 hartree
zpe.sumelectthermal: -1312.618949 hartree
zpe.sumelectthermalent: -1312.618005 hartree
zpe.sumelectthermalfe: -1312.698854 hartree
dipole: -6.1995 -1.2398 0.0124
dipole: 6.3222
quadrupole: -158.5336 -137.7919 -133.2272
quadrupole: -6.3329 -0.1753 -0.2219
quadrupole: -15.3494 5.3923 9.9570 -6.3329 -0.1753 -0.2219
hfenergy: -1312.9948605 hartree
pointgroup: C01 [X(C14H22N4O2S1)]
dipole: -2.4416486 0.4740366 -0.0248354 debye
polarizability: 311.029794|-4.9313646|219.2038728|0.0782277|-2.148623|118.5231463 unknown
InChI: InChI=1S/C14H22N4O2S/c1-4-5-6-7-8-9-21-14-15-11-10(17(14)2)12(19)16-13(20)18(11)3/h16H,4-9H2,1-3H3
charge 0 multiplicity 1
43 atoms
S  -0.676314 1.990418 -0.001474
O  5.264052 1.783257 -0.057474
O  5.032772 -2.902374 0.093546
N  2.096805 1.718254 -0.025878
N  2.979626 -1.744935 0.074006
N  0.98398 -0.285758 0.04618
N  5.05442 -0.56313 0.017649
C  -4.358699 -0.094505 -0.04528
C  -5.817286 0.4085 0.051777
C  -3.325516 1.05625 0.040564
C  -6.860711 -0.724892 -0.069758
C  -1.889119 0.518531 -0.026698
C  -8.319326 -0.223365 0.035824
C  3.073269 0.703328 -0.003162
C  2.352758 -0.504149 0.040525
C  0.868397 1.073827 0.005919
C  4.5110 0.76035 -0.018457
C  -9.357374 -1.358717 -0.09556
C  2.343945 3.169066 -0.077001
C  4.393355 -1.813922 0.063412
C  2.18703 -2.987465 0.123455
H  -4.168323 -0.826399 0.766595
H  -4.222259 -0.641866 -1.000601
H  -5.960193 0.936496 1.0175
H  -5.999622 1.160141 -0.744504
H  -3.505037 1.768419 -0.789319
H  -3.475223 1.615632 0.984937
H  -6.677172 -1.482606 0.720694
H  -6.724199 -1.248127 -1.03926
H  -1.633183 -0.118191 0.834403
H  -1.690085 -0.040412 -0.954839
H  -8.500196 0.537318 -0.751019
H  -8.456643 0.295434 1.006546
H  -9.21972 -2.116443 0.69892
H  -9.259325 -1.873982 -1.069703
H  -10.390934 -0.974067 -0.01945
H  1.885028 3.602989 -0.982571
H  1.919084 3.662209 0.814734
H  3.432918 3.328519 -0.10194
H  6.077035 -0.626843 0.010533
H  1.535056 -3.057251 -0.763313
H  1.556165 -2.999445 1.028057
H  2.893668 -3.830097 0.142386
