program: Gaussian 09
title: 000255845
version: EM64L-G09RevD.01
frameworkgroup: C1[X(C12H20O8S4)]
method: RPBEPBE
basis: SDD
operation: Freq
keyword: #p
keyword: freq=noraman
keyword: PBEPBE/SDD
title: #p freq=noraman PBEPBE/SDD
converged: NO YES NO NO
title: Mulliken charges:
elementType: S S S S O O O O O O O O C C C C C C C C C C C C H H H H H H H H H H H H H H H H H H H H
charge: 0.959339 0.952735 0.952706 0.961100 -0.512329 -0.510674 -0.501690 -0.530311 -0.501527 -0.530123 -0.510455 -0.512961 -0.411156 -0.412223 -0.525769 0.393153 -0.507452 -0.506682 -0.549975 -0.543147 -0.541829 -0.552100 -0.744492 -0.745742 0.380826 0.393340 0.310133 0.304956 0.304325 0.309321 0.321637 0.309298 0.321327 0.312737 0.313536 0.320744 0.308945 0.322033 0.238433 0.237115 0.246880 0.226595 0.222713 0.226710
chargesum: 0.00000
title: Mulliken charges with hydrogens summed into heavy atoms:
elementType: S S S S O O O O O O O O C C C C C C C C C C C C
charge: 0.959339 0.952735 0.952706 0.961100 -0.512329 -0.510674 -0.501690 -0.530311 -0.501527 -0.530123 -0.510455 -0.512961 -0.411156 -0.412223 0.248396 0.393153 0.107638 0.106965 0.080960 0.090917 0.092452 0.078878 -0.022064 -0.069725
polarizability: 2.91737705e+02 -1.53901032e-01 2.47230073e+02 -1.64983189e-02 1.49003070e+00 2.35624755e+02
1716.lowfreq: -13.8348 -7.9821 -6.2341 -0.0021 0.0008 0.0020 31.4491 36.6063 39.0115
frequency: 31.3073 36.5952 38.9962 50.8981 84.2285 97.6546 102.3177 120.8013 123.4558 144.0306 145.3753 168.2423 187.8164 192.0899 194.3675 198.6261 200.9157 202.5092 216.5770 220.1891 225.3559 254.8725 258.8889 268.1109 273.1600 279.9132 290.4760 292.2445 315.9451 319.1997 326.0901 341.4656 350.9457 362.6416 378.0905 379.8071 388.5366 398.3616 419.6067 435.1310 457.5180 468.0197 482.5217 509.1814 513.2256 523.6729 552.5745 553.7749 616.0806 715.6168 779.1173 789.0526 793.7962 805.1662 808.9359 840.0536 842.2705 844.2393 875.9456 896.4337 896.7512 899.5046 926.1358 931.5553 940.2675 942.4334 955.4142 964.2621 967.0060 968.1727 1008.2043 1018.0379 1035.9966 1036.9522 1069.6161 1070.4232 1128.5969 1129.0844 1160.4750 1173.7423 1186.1890 1216.0976 1224.8871 1228.3224 1230.5090 1253.2437 1265.4915 1266.0572 1289.6084 1315.5455 1320.6349 1351.9031 1377.2770 1386.9599 1399.8764 1400.0767 1409.1117 1409.6685 1418.9089 1440.3631 1444.2572 1450.6845 1465.7494 1469.8665 1483.6055 1495.8858 2806.4321 2844.6060 2942.3593 2943.7406 2976.5970 2981.9214 3000.6146 3003.0903 3054.5795 3054.7713 3058.9111 3059.0528 3069.2383 3074.8523 3078.6111 3092.2991 3148.8227 3149.0099 3159.4404 3159.5361
redmass: 8.4372 8.5609 7.8344 6.7077 4.7283 6.3394 7.4433 4.9333 5.0029 5.5377 8.6573 9.0507 3.4128 7.6611 7.7781 1.2722 2.8102 10.5035 4.4568 4.6183 4.0801 4.5124 2.5071 1.8293 4.9515 6.6857 5.7583 2.2835 3.7624 4.8860 3.8576 10.2433 2.7599 5.3850 4.2491 6.5959 8.1042 10.8066 3.1133 2.2775 3.8697 3.5239 5.3267 4.5829 5.7097 4.3439 3.5401 3.4569 7.8819 5.5678 3.6579 9.3393 7.9565 14.4965 12.8199 3.9153 1.7031 1.7520 2.8117 2.5515 1.8968 2.8962 3.9338 6.2915 3.0183 1.5199 2.0416 2.7191 1.8157 2.9490 1.8487 1.3600 1.6912 1.6917 1.1074 1.1181 1.6451 1.6456 2.2103 1.9177 2.5913 4.9448 1.3263 1.2693 3.2928 1.4298 1.2045 1.2083 1.1876 1.4803 1.2250 1.3948 1.2916 1.1892 1.0880 1.0878 1.1234 1.1211 1.1966 1.0786 1.0688 1.0613 1.0499 1.0532 1.0619 1.0526 1.0614 1.0942 1.0598 1.0601 1.0356 1.0380 1.0982 1.0988 1.0533 1.0533 1.0591 1.0590 1.0982 1.0991 1.0997 1.1003 1.1118 1.1117 1.1110 1.1111
irintensity: 0.1157 3.4767 3.6325 10.7292 1.4264 0.7367 0.2901 4.9949 5.4960 0.1005 4.1989 22.5207 8.6546 9.1887 3.1236 0.0329 0.7975 0.4402 8.9123 2.9322 5.9376 5.4426 19.3547 2.0055 4.6777 2.2704 0.7602 8.6321 37.0574 36.1787 24.1101 0.5498 3.6896 25.5899 14.8422 0.2959 34.9016 8.6273 1.3979 2.2486 9.1877 11.2886 9.4989 17.5298 66.8983 9.2987 2.5212 2.4487 4.3028 0.1284 10.1517 4.6039 132.6351 1.3098 2.0581 1.2204 12.0132 110.7895 0.3136 0.0204 0.6708 2.2159 87.2186 67.6710 58.0339 9.6721 3.1766 9.2196 6.1287 5.8244 1.2608 0.0429 1.1118 0.9559 6.3659 12.7334 14.7588 5.4839 7.8998 13.4602 0.8742 8.3498 0.3484 7.3466 34.0151 8.6532 0.8662 2.0597 13.5787 3.8258 1.6684 56.8367 82.8652 15.2329 46.1622 8.7140 4.1191 7.7211 14.4526 0.6069 33.4182 1.1631 1.4229 29.5732 15.8597 17.7373 15.1842 25.6733 2.2842 0.1924 23.4029 6.1923 0.3443 5.2899 0.0316 0.0233 2.1327 1.7762 12.4301 29.7134 13.5911 19.2834 1.7303 1.5662 2.4051 3.1930
temp: 298.150 k
press: 1.00000 atm
elementType: 16 16 16 16 8 8 8 8 8 8 8 8 6 6 6 6 6 6 6 6 6 6 6 6 1 1 1 1 1 1 1 1 1 1 1 1 1 1 1 1 1 1 1 1
symmnumber: 1
zpe: 831793.0 jmol-1
zpe.correction: 0.316813 hartree
zpe.thermalcorrener: 0.344626 hartree
zpe.thermalcorrenthalpy: 0.345570 hartree
zpe.thermalcorrgfe: 0.260673 hartree
zpe.sumelectzpe: -2660.790008 hartree
zpe.sumelectthermal: -2660.762194 hartree
zpe.sumelectthermalent: -2660.761250 hartree
zpe.sumelectthermalfe: -2660.846148 hartree
dipole: 0.0482 0.0782 -0.4333
dipole: 0.4429
quadrupole: -136.1574 -214.9953 -181.9306
quadrupole: -0.0705 0.4793 -16.6980
quadrupole: 41.5371 -37.3009 -4.2362 -0.0705 0.4793 -16.6980
hfenergy: -2661.1068208 hartree
pointgroup: C01 [X(C12H20O8S4)]
dipole: 0.0180282 -0.0968942 0.1436934 debye
polarizability: 291.6466253|-1.8037294|244.3744373|-0.8964028|5.2929616|238.571471 unknown
InChI: InChI=1S/C12H20O8S4/c1-10(2)7-11(21(13,14)3-4-22(11,15)16)9-12(8-10)23(17,18)5-6-24(12,19)20/h3-9H2,1-2H3
charge 0 multiplicity 1
44 atoms
S  -2.38753 -1.431752 -0.915008
S  -2.480619 0.774016 1.310495
S  2.62261 0.550741 1.191367
S  2.227864 -1.6412 -1.013684
O  -1.812565 -2.783338 -0.196364
O  -2.559661 -1.296339 -2.530363
O  -1.635597 0.820165 2.704696
O  -3.298604 2.071132 0.735982
O  1.850974 0.654599 2.624053
O  3.510527 1.784546 0.581223
O  2.309954 -1.543918 -2.638582
O  1.595827 -2.932391 -0.233303
C  -1.255281 0.127055 -0.207218
C  1.275631 0.009464 -0.267233
C  0.002311 -0.436908 0.429738
C  0.07736 2.047699 -1.224107
C  -1.221454 1.18932 -1.276716
C  1.286908 1.071965 -1.337927
C  -4.107663 -1.05286 -0.0443
C  -3.789405 -0.685969 1.385009
C  3.816031 -1.00857 1.193344
C  4.019447 -1.392056 -0.252839
C  0.148946 2.896655 0.071056
C  0.092169 2.98336 -2.457564
H  0.042046 -0.119439 1.505417
H  -0.049191 -1.556563 0.460402
H  -2.104938 1.852626 -1.172615
H  -1.301152 0.692538 -2.268179
H  1.269639 0.57143 -2.330491
H  2.231235 1.651684 -1.279487
H  -4.646983 -2.007211 -0.147834
H  -4.56436 -0.246267 -0.637212
H  -4.631781 -0.23118 1.928709
H  -3.296706 -1.48407 1.960881
H  3.293921 -1.767616 1.795423
H  4.722009 -0.624406 1.686801
H  4.498786 -0.618999 -0.872132
H  4.481391 -2.382448 -0.38768
H  1.079896 3.490414 0.088043
H  -0.710309 3.58833 0.122186
H  0.133997 2.292755 0.998264
H  1.013741 3.593457 -2.471559
H  0.043406 2.412592 -3.403537
H  -0.76843 3.67636 -2.430156
