program: Gaussian 09
title: 000255777
version: EM64L-G09RevD.01
frameworkgroup: C1[X(C23H16N2)]
method: RPBEPBE
basis: SDD
operation: Freq
keyword: #pfreq=noraman
keyword: PBEPBE/SDD
title: #p freq=noraman PBEPBE/SDD
converged: YES YES NO NO
title: Mulliken charges:
elementType: N N C C C C C C C C C C C C C C C C C C C C C C C H H H H H H H H H H H H H H H H
charge: 0.045804 -0.686729 0.119331 0.371453 0.216801 -0.548252 0.309052 -0.455453 0.428701 -0.030186 -0.456990 -0.395414 -0.468097 0.446783 -0.257231 -0.235214 -0.416248 -0.341814 -0.256112 -0.234306 -0.393102 -0.393780 -0.432004 -0.427073 0.483833 0.248010 0.222428 0.276959 0.282347 0.223723 0.228903 0.232381 0.261964 0.226372 0.228853 0.277715 0.231783 0.222981 0.219633 0.311576 0.310622
chargesum: 0.00000
title: Mulliken charges with hydrogens summed into heavy atoms:
elementType: N N C C C C C C C C C C C C C C C C C C C C C C C
charge: 0.045804 -0.064530 0.119331 0.371453 0.216801 -0.548252 0.309052 -0.207444 0.428701 -0.030186 -0.234563 -0.118455 -0.185750 0.446783 -0.033509 -0.006311 -0.183867 -0.079850 -0.029740 -0.005453 -0.115387 -0.161997 -0.209023 -0.207440 0.483833
polarizability: 5.99222063e+02 -3.34101521e+00 3.25555017e+02 2.75931692e+00 1.37580289e+01 1.15650793e+02
1716.lowfreq: -6.0115 -0.0007 -0.0004 0.0003 2.7841 3.4130 34.2735 36.2897 52.2663
frequency: 34.2678 36.2803 52.2566 77.1492 90.1019 119.9590 144.0120 162.8758 178.6094 207.3814 236.4424 262.7105 315.3423 318.4927 355.8087 370.5202 386.9941 394.4012 399.0263 410.0520 416.1759 445.2703 470.6188 478.5210 495.3405 528.5704 532.7132 552.0924 565.5079 585.6802 596.3352 618.8479 623.4136 638.9427 709.0828 719.7546 737.1644 740.3217 752.7666 761.8201 776.6333 788.9243 793.6611 813.4607 828.4739 831.4487 833.6130 868.6149 872.8182 883.3191 899.4043 918.6781 927.0889 951.1241 957.2028 964.6675 980.2837 990.3649 995.4693 998.8311 1004.4556 1017.6953 1019.4328 1039.4737 1075.4828 1118.1629 1125.0585 1135.9855 1158.0074 1169.5931 1190.3044 1193.6779 1206.2839 1235.0209 1246.5448 1255.9996 1299.7419 1308.5657 1317.2996 1327.4098 1351.7579 1378.4590 1384.9353 1395.0587 1407.4452 1409.6779 1443.4975 1448.4725 1460.4741 1473.5450 1504.0349 1518.6336 1555.1365 1562.4210 1577.9852 1603.9582 1613.0867 1619.9666 1623.7162 1634.7557 1646.8305 3064.0503 3114.2960 3115.2998 3117.5702 3121.1716 3126.6047 3134.0585 3138.4474 3145.1048 3152.4208 3158.9968 3163.5348 3167.4350 3170.9093 3562.0045 3701.7803
redmass: 5.0638 4.6316 4.3550 5.0626 4.3201 5.6266 4.3314 4.9043 5.3784 4.9130 5.1659 4.6590 5.1741 5.0166 3.4757 4.1831 3.3580 1.0296 1.3129 2.9451 3.1196 4.8018 3.3517 3.1698 6.0306 4.1941 3.3234 6.4034 3.4806 5.8912 6.9052 3.9563 7.5405 6.7629 6.0477 3.5742 2.5592 4.3948 5.4118 1.3762 1.8019 3.0142 4.5345 1.4430 1.9355 3.0797 2.9639 4.0234 1.5715 1.7652 1.7395 3.7320 1.6676 1.4337 1.3911 1.4082 1.3686 1.3275 1.3907 2.6425 3.7545 2.0104 1.5899 2.2269 3.4966 1.7639 1.6180 1.3260 1.3605 1.1762 1.4159 1.2242 1.9159 2.4751 2.0364 1.9120 2.1229 1.9019 1.6827 3.2205 1.8358 3.1274 4.6096 4.1875 3.0461 3.1029 2.9238 3.6605 2.7371 3.7279 4.3810 3.1678 8.7045 6.3852 6.4075 6.7346 7.7330 6.7283 7.1119 2.4711 1.6763 1.0863 1.0868 1.0889 1.0901 1.0891 1.0858 1.0884 1.0967 1.0907 1.0943 1.0950 1.0961 1.0996 1.0972 1.0450 1.1040
irintensity: 0.5744 0.5218 1.4170 1.1578 0.5786 1.0036 0.5751 2.4103 0.2528 3.3042 1.5644 2.5422 2.3088 0.4776 6.3268 5.5245 1.3880 12.5014 267.2799 31.7044 5.3311 3.5624 5.8503 20.6868 6.8410 9.7975 8.9552 13.5271 0.9148 9.9617 2.1955 5.1484 0.8903 0.8350 0.8970 5.1500 20.3908 2.6844 1.1699 77.5483 60.2450 10.8044 0.9759 7.7475 28.3726 10.4490 21.9114 7.3253 7.3790 45.6217 4.8583 6.1750 14.5173 2.6052 1.9856 9.4688 2.1312 0.1157 0.9733 0.1083 6.9295 9.9120 4.1450 1.2207 5.6951 13.9599 13.5488 13.9278 0.4540 5.7586 20.0620 93.0278 11.8810 41.5082 1.8222 8.6477 2.3430 14.7687 23.1475 148.8677 13.5974 15.3817 3.3469 4.6114 74.3943 15.9516 3.6301 10.5773 19.7046 24.4477 20.0833 178.2062 3.5872 6.3197 2.3998 232.8989 22.9938 165.9592 206.0505 1.9616 366.4350 14.3061 12.8405 0.7756 14.9777 27.6987 1.4607 9.2505 40.0134 19.2872 27.9897 5.9321 12.3096 46.9529 23.1611 201.7110 22.7183
temp: 298.150 k
press: 1.00000 atm
elementType: 7 7 6 6 6 6 6 6 6 6 6 6 6 6 6 6 6 6 6 6 6 6 6 6 6 1 1 1 1 1 1 1 1 1 1 1 1 1 1 1 1
symmnumber: 1
zpe: 841019.2 jmol-1
zpe.correction: 0.320327 hartree
zpe.thermalcorrener: 0.339156 hartree
zpe.thermalcorrenthalpy: 0.340100 hartree
zpe.thermalcorrgfe: 0.273006 hartree
zpe.sumelectzpe: -993.915302 hartree
zpe.sumelectthermal: -993.896473 hartree
zpe.sumelectthermalent: -993.895529 hartree
zpe.sumelectthermalfe: -993.962624 hartree
dipole: -6.4224 -2.5128 0.1194
dipole: 6.8975
quadrupole: -93.0891 -127.9439 -151.0856
quadrupole: -0.3492 -2.2135 5.1005
quadrupole: 30.9505 -3.9043 -27.0461 -0.3492 -2.2135 5.1005
hfenergy: -994.2356294 hartree
pointgroup: C01 [X(C23H16N2)]
dipole: 2.4747101 -1.1074718 0.115892 debye
polarizability: 598.8740469|-9.7124564|317.6651496|4.1491113|-43.0790275|123.8886756 unknown
InChI: InChI=1S/C23H16N2/c24-17-11-9-15(10-12-17)13-20-18-6-2-3-7-19(18)23-21(20)14-16-5-1-4-8-22(16)25-23/h1-14H,24H2
charge 0 multiplicity 1
41 atoms
N  -3.083393 1.201934 -0.292785
N  6.957911 -1.604874 -0.103807
C  -1.089789 -0.231816 0.118721
C  0.378226 -0.008942 0.145989
C  0.565212 1.453278 -0.079637
C  -1.757598 1.029345 -0.16625
C  -0.720625 2.065393 -0.275049
C  -1.875323 -1.371541 0.27289
C  -3.301718 -1.246647 0.158674
C  -3.86905 0.06333 -0.127569
C  1.270831 -1.037508 0.388191
C  1.710506 2.28483 -0.033591
C  -0.865583 3.451478 -0.47516
C  2.726872 -1.118651 0.260168
C  1.564776 3.679014 -0.222167
C  0.291566 4.261442 -0.458263
C  -4.185515 -2.363302 0.311338
C  -5.287653 0.196094 -0.247924
C  -5.568955 -2.203527 0.188979
C  -6.123402 -0.914457 -0.092582
C  3.48456 -0.373959 -0.695075
C  3.442882 -2.066713 1.053792
C  4.871852 -0.536063 -0.822912
C  4.832832 -2.225602 0.952181
C  5.579231 -1.453238 0.012446
H  -1.441007 -2.358589 0.473974
H  0.809853 -1.983216 0.715577
H  2.701747 1.871957 0.170197
H  -1.862605 3.877513 -0.623456
H  2.452285 4.320947 -0.181515
H  0.208244 5.343123 -0.611106
H  -3.758827 -3.351103 0.526266
H  -5.684986 1.192764 -0.464209
H  -6.234931 -3.065348 0.307684
H  -7.209205 -0.801767 -0.186499
H  2.964546 0.30086 -1.381688
H  2.888983 -2.678486 1.776867
H  5.418842 0.036069 -1.582447
H  5.350156 -2.952404 1.590269
H  7.487444 -1.061739 -0.779738
H  7.462809 -2.261577 0.484426
