program: Gaussian 09
title: 000255741
version: EM64L-G09RevD.01
frameworkgroup: C1[X(C12H18N4O2S)]
method: RPBEPBE
basis: SDD
operation: Freq
keyword: #p
keyword: freq=noraman
keyword: PBEPBE/SDD
title: #p freq=noraman PBEPBE/SDD
converged: YES YES NO NO
title: Mulliken charges:
elementType: S O O N N N N C C C C C C C C C C C C H H H H H H H H H H H H H H H H H H
charge: 0.234405 -0.268696 -0.269014 -0.165177 -0.373794 -0.218642 -0.054279 -0.357471 -0.286680 0.104486 0.106822 -0.367329 -0.169560 -0.701901 0.132463 0.211417 -0.691750 -0.616283 -0.598684 0.298756 0.201867 0.232523 0.203492 0.202361 0.342754 0.222170 0.238613 0.230818 0.219237 0.213041 0.213932 0.274593 0.244660 0.242737 0.268497 0.249914 0.249701
chargesum: 0.00000
title: Mulliken charges with hydrogens summed into heavy atoms:
elementType: S O O N N N N C C C C C C C C C C C C
charge: 0.234405 -0.268696 -0.269014 -0.165177 -0.031040 -0.218642 -0.054279 -0.058715 0.147710 0.104486 0.106822 0.038524 -0.169560 -0.010300 0.132463 0.211417 -0.045541 0.145708 0.169428
polarizability: 2.74281032e+02 -4.83141970e+00 1.88892263e+02 -1.47661814e+01 -1.29032595e+01 1.15301409e+02
1716.lowfreq: -7.1958 -3.0192 -0.0004 0.0012 0.0016 5.4844 14.2245 24.2821 54.0337
frequency: 13.5041 24.2245 54.0164 68.9911 77.0273 100.1633 104.7829 110.7534 115.9490 121.8222 146.3944 172.2314 182.9758 209.5618 214.8695 228.5244 261.9690 289.7324 305.3088 316.9786 330.4343 350.0162 357.7593 378.5768 392.5632 405.1073 440.1325 479.8298 490.7257 587.4496 623.0101 628.9981 637.1954 674.8557 679.0787 703.6509 737.4716 742.9132 765.5881 847.5429 869.8287 921.7801 926.6730 936.8565 968.5232 992.2399 1009.2473 1037.8684 1055.5581 1090.5539 1102.8544 1129.4632 1131.9429 1137.1339 1161.4507 1168.3005 1194.3706 1223.9631 1227.1658 1243.0263 1261.8865 1284.0647 1286.2406 1299.6775 1321.4428 1331.7970 1346.2180 1372.2259 1389.5737 1392.7073 1395.1762 1418.9237 1429.8093 1455.7328 1472.1366 1473.4894 1474.1021 1474.5345 1476.0010 1478.2005 1478.6953 1480.7605 1485.8651 1511.6976 1578.1945 1616.9221 1659.0734 2973.2709 2976.0715 2986.1206 2986.3889 3005.1227 3011.3318 3020.6614 3045.4904 3058.6059 3074.6179 3076.4719 3081.2001 3093.7448 3093.8406 3103.4522 3136.7491 3137.8598 3589.4432
redmass: 4.9803 3.7394 2.2563 3.9040 2.3483 1.1612 2.6105 1.4910 2.8415 2.5438 3.8451 3.6885 4.6770 1.2042 8.7004 1.2363 2.3433 3.2549 5.7856 4.2572 3.0598 3.7963 7.3017 7.1102 5.8986 5.2046 2.8407 7.5631 9.7286 6.5569 4.1102 8.2012 1.3774 8.5310 4.5554 11.1936 11.0872 1.1182 4.9158 1.4989 1.6547 1.9104 4.4139 5.9799 3.8411 1.3059 1.6716 3.2574 2.4767 1.9723 3.9398 1.3026 1.2983 2.3477 1.9035 1.8879 3.3054 1.2798 2.6553 1.2882 6.1075 1.2596 5.3254 1.2342 5.4664 1.5317 1.4487 4.8320 1.2621 2.6588 1.2212 1.3219 1.2870 1.0782 1.0565 1.0632 1.0727 1.1418 1.0467 1.0543 1.0662 1.0479 1.0782 3.2001 8.3459 10.5011 10.4993 1.0529 1.0425 1.0369 1.0602 1.0337 1.0327 1.0986 1.0915 1.0983 1.1011 1.0997 1.0979 1.0998 1.1023 1.1022 1.1024 1.1008 1.0820
irintensity: 0.0831 0.0450 0.2962 0.0047 0.0292 0.1545 0.0679 1.8263 0.0224 2.6746 1.3076 4.1263 17.6087 0.3263 2.1605 0.1179 1.3843 4.4046 0.2087 1.2814 4.8134 9.1574 0.9052 18.5065 15.9165 6.0026 5.8345 17.9115 7.3928 3.2410 29.5630 1.8103 93.4977 2.8252 21.3531 4.3309 14.3497 9.3294 0.6091 3.4328 6.1515 0.9852 3.6819 11.1292 40.9614 8.2279 18.2942 38.5319 9.6198 35.2663 23.0543 0.2765 0.1635 5.5363 34.5319 4.7941 72.1477 9.2868 4.9503 7.0869 29.2382 2.2395 24.6889 22.1682 58.5642 10.9577 18.6184 8.8016 35.0502 404.2131 13.2133 167.9524 69.9859 6.4384 2.7570 19.3950 5.4776 11.1956 7.9290 1.9496 9.9986 16.8594 16.1043 151.0268 12.4621 527.2904 567.4296 26.2524 21.2160 29.5611 33.0690 34.4860 31.5100 5.7236 9.7606 1.5191 66.3075 55.5911 26.1727 15.0367 32.2644 17.8253 0.7912 0.4156 93.5982
temp: 298.150 k
press: 1.00000 atm
elementType: 16 8 8 7 7 7 7 6 6 6 6 6 6 6 6 6 6 6 6 1 1 1 1 1 1 1 1 1 1 1 1 1 1 1 1 1 1
symmnumber: 1
zpe: 777555.2 jmol-1
zpe.correction: 0.296155 hartree
zpe.thermalcorrener: 0.316813 hartree
zpe.thermalcorrenthalpy: 0.317757 hartree
zpe.thermalcorrgfe: 0.244849 hartree
zpe.sumelectzpe: -1234.196430 hartree
zpe.sumelectthermal: -1234.175773 hartree
zpe.sumelectthermalent: -1234.174828 hartree
zpe.sumelectthermalfe: -1234.247737 hartree
dipole: 5.1810 0.3453 -0.4909
dipole: 5.2156
quadrupole: -122.4925 -126.0857 -120.9874
quadrupole: 1.9870 -0.7228 1.5159
quadrupole: 0.6960 -2.8971 2.2011 1.9870 -0.7228 1.5159
hfenergy: -1234.4925853 hartree
pointgroup: C01 [X(C12H18N4O2S1)]
dipole: 2.0408731 -0.1591812 0.1418976 debye
polarizability: 274.9882577|3.477384|189.1057646|10.8080301|-12.2526767|114.380681 unknown
InChI: InChI=1S/C12H18N4O2S/c1-5-6-7(2)19-11-13-8-9(14-11)15(3)12(18)16(4)10(8)17/h7,13H,5-6H2,1-4H3
charge 0 multiplicity 1
37 atoms
S  2.503205 2.101798 0.04702
O  -3.305285 2.380508 -0.833764
O  -3.684407 -2.148685 0.459179
N  -1.534788 -1.205746 0.454853
N  -0.258014 2.014448 -0.334082
N  -3.472767 0.097481 -0.180143
N  0.615088 0.030383 0.371163
C  3.600618 0.554116 0.439478
C  3.791828 -0.28746 -0.836909
C  -1.336098 1.124716 -0.209755
C  -0.76317 -0.078872 0.221481
C  4.529425 -1.625593 -0.572392
C  0.887969 1.320507 0.025337
C  4.896141 1.102667 1.056154
C  -2.739293 1.311989 -0.445886
C  -2.939416 -1.147361 0.257871
C  4.607453 -2.495884 -1.845641
C  -0.914558 -2.463018 0.912791
C  -4.94083 0.125679 -0.37394
H  3.00181 -0.005088 1.179085
H  4.348342 0.303897 -1.591352
H  2.798035 -0.5156 -1.265542
H  3.998532 -2.182243 0.226292
H  5.55392 -1.430868 -0.199062
H  -0.331931 2.985405 -0.636971
H  5.458658 1.722327 0.333543
H  4.691604 1.710205 1.954419
H  5.547383 0.262474 1.356956
H  5.133141 -3.448201 -1.650205
H  5.14944 -1.969482 -2.653608
H  3.59601 -2.737444 -2.222401
H  -1.715871 -3.208909 1.016135
H  -0.413051 -2.307902 1.8830
H  -0.167094 -2.806526 0.17796
H  -5.206267 1.140124 -0.705998
H  -5.452228 -0.11868 0.571395
H  -5.237934 -0.61936 -1.12996
