program: Gaussian 09
title: 000255724
version: EM64L-G09RevD.01
frameworkgroup: C1[X(C5H10N4O2)]
method: RPBEPBE
basis: SDD
operation: Freq
keyword: #p
keyword: freq=noraman
keyword: PBEPBE/SDD
title: #p freq=noraman PBEPBE/SDD
converged: YES YES NO NO
title: Mulliken charges:
elementType: O O N N N N C C C C C H H H H H H H H H H
charge: -0.280504 -0.251382 -0.097128 -0.176900 -0.619700 -0.623896 0.043379 -0.751261 0.183703 0.284064 -0.502977 0.261977 0.237544 0.237879 0.238115 0.237708 0.226666 0.341313 0.317320 0.386894 0.307184
chargesum: 0.00000
title: Mulliken charges with hydrogens summed into heavy atoms:
elementType: O O N N N N C C C C C
charge: -0.280504 -0.251382 -0.097128 -0.176900 0.038934 0.070182 0.043379 -0.013862 0.183703 0.284064 0.199513
polarizability: 1.91962412e+02 7.87729487e+00 9.18218505e+01 7.50189011e-02 2.19697185e-03 4.91511695e+01
1716.lowfreq: -9.1877 0.0006 0.0007 0.0008 5.2582 9.1637 45.2274 69.1559 86.7399
frequency: 45.2256 69.1551 86.7313 90.9098 95.1038 118.8740 154.0649 192.4692 212.1533 283.3494 306.6694 331.5730 331.7835 431.5871 455.3048 476.9113 494.2276 531.7977 598.3484 670.8397 688.0771 705.6755 782.7552 785.2705 921.6594 956.5391 989.3162 1021.3375 1033.8798 1046.9315 1090.3407 1112.9552 1137.3894 1151.2816 1278.5830 1380.6830 1419.9338 1449.0568 1449.2300 1464.9854 1465.4711 1478.5643 1514.4873 1572.4872 1583.5851 1627.3475 1628.8290 2993.0208 2996.8955 3072.1991 3094.9799 3117.8983 3139.1938 3427.7895 3558.7990 3671.7763 3712.9866
redmass: 5.0804 4.1809 1.0408 4.4445 1.1018 3.9425 3.2017 1.2536 3.5688 4.2382 3.9440 3.9677 3.7928 1.2428 2.5664 5.8983 4.2639 1.1495 4.7524 4.8782 4.3053 7.1358 1.2106 4.8934 5.5821 6.1414 2.0873 1.5674 1.5259 1.9948 4.2827 1.2663 2.2942 2.4451 4.7824 1.2275 1.1936 1.1352 1.0786 1.0740 1.0487 2.0710 2.1329 3.0786 2.2597 6.1248 1.8104 1.0361 1.0297 1.0967 1.1039 1.1002 1.1042 1.0533 1.0455 1.0952 1.1047
irintensity: 6.6383 0.1602 1.0975 4.6614 1.2581 12.4261 0.0568 0.7998 8.3017 5.0997 0.3886 37.1888 15.2160 413.0847 0.2338 7.6169 0.4782 42.5360 15.2931 0.0612 16.7600 14.4782 145.9364 8.3073 84.1650 52.4047 5.0316 12.2868 0.8426 72.1847 699.1226 0.1344 77.7569 2.4158 235.1962 37.3891 62.1805 5.2800 10.5614 46.6267 14.9994 412.4555 273.6288 37.7265 308.5742 272.1070 386.2780 16.4880 50.7927 15.4304 32.1443 6.1022 22.2569 51.1310 107.7378 75.2662 48.2311
temp: 298.150 k
press: 1.00000 atm
elementType: 8 8 7 7 7 7 6 6 6 6 6 1 1 1 1 1 1 1 1 1 1
symmnumber: 1
zpe: 427660.6 jmol-1
zpe.correction: 0.162887 hartree
zpe.thermalcorrener: 0.175969 hartree
zpe.thermalcorrenthalpy: 0.176913 hartree
zpe.thermalcorrgfe: 0.122872 hartree
zpe.sumelectzpe: -565.106843 hartree
zpe.sumelectthermal: -565.093762 hartree
zpe.sumelectthermalent: -565.092818 hartree
zpe.sumelectthermalfe: -565.146858 hartree
dipole: -4.4167 0.0296 -0.0088
dipole: 4.4168
quadrupole: -26.8378 -64.2666 -67.0512
quadrupole: 6.2777 -0.0045 0.0311
quadrupole: 25.8808 -11.5481 -14.3327 6.2777 -0.0045 0.0311
hfenergy: -565.2697303 hartree
pointgroup: C01 [X(C5H10N4O2)]
dipole: 1.7348759 0.0234208 0.0963549 debye
dipolederiv: -1.7658074 0.1305733 -0.1316428 0.3654353 -0.5069458 0.0977386 -0.2141106 0.0844904 -0.3364724 -0.726815 -0.126367 0.0219741 -0.3538645 -0.8915839 0.1842562 0.1054482 0.1981649 -0.3863703 1.4167406 0.0533091 0.0722284 0.4060548 -0.4560378 0.1429373 -0.0567505 0.1221915 -0.1751371 -2.3276749 0.1696673 -0.1829772 0.1070333 -0.3699485 0.0432604 -0.1603152 0.0470375 -0.2940294 -1.7444661 -0.2824608 0.0408748 -0.4203168 -0.42214 -0.1328331 0.0894111 -0.1244699 -0.6702845 -0.4863977 0.0440882 -0.0069203 0.5275191 -1.1001538 0.1931279 -0.1796331 0.1635072 -0.7176186 -1.1740078 -0.1553952 -0.0101455 -0.2452754 0.3798583 -0.1675433 0.02344 -0.1626211 0.0187881 -0.14573 0.0690398 -0.0396982 0.0788761 -0.2433812 0.1304621 -0.0452316 0.1305832 0.054181 2.4071145 -0.0086086 0.1305659 0.2962883 0.9524025 -0.2526586 0.0195148 -0.2713631 0.2982074 2.7602589 0.0566784 0.1277503 -0.9284602 1.2621511 -0.4155172 0.4839155 -0.358326 0.41744 0.7778704 0.0480442 0.0120065 0.161635 0.2443901 0.0245436 -0.0319742 0.0182861 0.2757902 -0.001213 -0.1503226 0.0458818 -0.0489688 0.0681643 0.0118168 0.0107943 0.0049796 0.1087463 0.0898488 0.0086457 -0.0982119 0.0364698 0.0790293 -0.0229813 -0.1161389 0.0233189 -0.0655382 0.0645236 0.082398 0.0804344 0.1092245 0.0291233 -0.0327186 0.0790534 -0.0818099 0.0124107 -0.0164557 -0.0115057 -0.0141889 -0.1011718 0.0743885 0.0481893 0.0833413 0.0440118 -0.1132205 -0.0168079 0.0089385 0.0182921 -0.1202925 -0.0487877 -0.1160657 -0.0009615 -0.1002222 0.0057594 -0.0847658 0.0726092 -0.0361228 0.1360397 0.0088657 0.0444201 -0.0581272 0.0411315 0.099708 0.2552056 0.0432616 -0.0235899 0.0917242 0.2261798 0.0646682 -0.0408537 0.0620356 0.3651345 0.2525646 0.0224 -0.0167317 -0.0071491 0.1788116 0.0795486 -0.0056068 0.0813261 0.3710629 0.3070998 -0.082317 0.027684 -0.0918972 0.3004614 0.0112843 0.0307757 0.012687 0.3441246 0.1589147 0.0073235 -0.017463 0.0010961 0.235153 0.0640645 -0.0159911 0.065061 0.3873179 unknown
polarizability: 191.3073664|-5.9297915|86.8080751|10.5110884|-13.9660259|54.8199911 unknown
InChI: InChI=1S/C5H10N4O2/c1-3(4(10)11-2)8-9-5(6)7/h6-7H2,1-2H3
charge 0 multiplicity 1
21 atoms
O  -2.847402 0.248261 -0.398593
O  -1.714379 -1.651215 0.349795
N  0.675526 -0.215656 -0.027677
N  1.848527 0.520332 -0.22402
N  4.159439 0.321419 -0.015835
N  2.791855 -1.537152 0.573311
C  -0.47194 0.382305 -0.312306
C  -0.625241 1.793808 -0.831931
C  -1.674164 -0.468916 -0.073654
C  2.915759 -0.252325 0.117297
C  -4.106924 -0.498849 -0.200126
H  0.368187 2.25793 -0.931364
H  -1.137242 1.79605 -1.811091
H  -1.252549 2.394949 -0.149729
H  -4.210707 -0.808185 0.854245
H  -4.126621 -1.399673 -0.83762
H  -4.90104 0.205785 -0.486454
H  4.186514 1.278459 -0.360358
H  5.021663 -0.164409 0.20977
H  1.81445 -1.85118 0.632348
H  3.570588 -2.132937 0.834989
