program: Gaussian 09
title: 000255719
version: EM64L-G09RevD.01
frameworkgroup: C1[X(C6H7BrN2O2)]
method: RPBEPBE
basis: SDD
operation: Freq
keyword: #p
keyword: freq=noraman
keyword: PBEPBE/SDD
title: #p freq=noraman PBEPBE/SDD
converged: NO YES NO NO
title: Mulliken charges:
elementType: Br O O N N C C C C C C H H H H H H H
charge: 0.046920 -0.239205 -0.208973 -0.119317 -0.003966 0.333667 -0.290048 0.026611 -0.235197 -0.504059 -0.500424 0.266121 0.241663 0.239608 0.239604 0.233448 0.233451 0.240098
chargesum: 0.00000
title: Mulliken charges with hydrogens summed into heavy atoms:
elementType: Br O O N N C C C C C C
charge: 0.046920 -0.239205 -0.208973 -0.119317 -0.003966 0.333667 -0.290048 0.026611 0.030924 0.216816 0.206573
polarizability: 1.56823632e+02 -3.05425536e+00 1.06383955e+02 -1.52644619e-03 1.13413672e-04 4.75913373e+01
1716.lowfreq: -7.6124 -4.7572 -0.0006 -0.0006 0.0003 2.5763 57.9633 112.1080 133.9101
frequency: 57.9606 112.1069 133.9087 136.3851 137.8939 159.9612 160.4063 236.7146 243.6310 298.9355 306.9292 453.3273 464.6584 517.9834 550.7363 644.7482 685.2772 700.7172 765.9956 894.5753 922.2046 949.9021 978.6125 1038.6176 1112.6570 1114.1543 1144.8144 1160.4332 1243.0280 1264.7991 1286.5656 1341.4242 1373.8278 1438.6511 1448.9390 1451.1309 1453.9505 1460.0236 1465.2688 1506.1298 1523.0636 2997.7682 3004.8940 3098.2512 3108.2825 3144.8864 3151.0363 3160.9393
redmass: 4.5429 2.3034 1.7222 1.1482 6.4116 2.0472 3.4985 6.1484 6.0562 5.2982 10.5681 3.6495 6.0425 6.3051 6.7052 7.2516 11.0370 7.7232 11.2421 7.6408 1.4121 9.9489 9.9058 4.5704 1.2522 1.2525 1.3838 1.5908 5.0604 3.2416 5.3511 3.6157 1.8958 1.4511 1.4031 1.0513 1.0513 1.0736 1.0725 5.4699 7.9168 1.0298 1.0294 1.1044 1.1048 1.1041 1.1047 1.0935
irintensity: 1.3158 1.8558 6.7037 0.2977 2.4328 3.5435 0.9334 5.4511 6.5678 10.5012 0.0024 0.3121 9.3501 3.9976 0.0997 23.2874 1.0155 6.5239 20.0377 7.4728 12.1149 37.3248 115.4986 21.8774 0.0731 0.2138 17.8604 28.3337 47.8212 75.1330 17.0678 302.3922 330.5489 40.9790 64.0651 0.0016 30.8232 23.9321 41.0340 270.1776 155.7707 38.3464 41.3061 30.4371 27.2526 25.0521 14.3567 7.3364
temp: 298.150 k
press: 1.00000 atm
elementType: 35 8 8 7 7 6 6 6 6 6 6 1 1 1 1 1 1 1
symmnumber: 1
zpe: 334996.9 jmol-1
zpe.correction: 0.127594 hartree
zpe.thermalcorrener: 0.138826 hartree
zpe.thermalcorrenthalpy: 0.139770 hartree
zpe.thermalcorrgfe: 0.089186 hartree
zpe.sumelectzpe: -505.389537 hartree
zpe.sumelectthermal: -505.378305 hartree
zpe.sumelectthermalent: -505.377361 hartree
zpe.sumelectthermalfe: -505.427945 hartree
dipole: 1.7363 3.7834 0.0003
dipole: 4.1628
quadrupole: -66.9865 -71.0250 -73.3976
quadrupole: 12.3078 0.0015 -0.0003
quadrupole: 3.4832 -0.5553 -2.9279 12.3078 0.0015 -0.0003
hfenergy: -505.5171307 hartree
pointgroup: C01[X(C6H7Br1N2O2)]
dipole: 0.3813559 -1.5927479 -0.0002222 debye
dipolederiv: -0.6812968 0.0881912 -0.0001348 0.0859054 -0.0164359 0.0000148 -0.0001484 0.0000181 0.0170539 -0.414043 -0.4541682 -0.0000701 -0.2448795 -1.5245487 -0.0001705 -0.0000708 -0.0002025 -0.3062922 -1.8153892 0.3903805 -0.0001676 0.3259171 -0.42284 -0.0000137 0.0002375 -0.0000899 -0.3183751 -1.0714405 -0.2428541 -0.0001477 -0.2540889 -0.5832576 -0.0000101 -0.0001576 -0.0001345 -0.1789534 -1.0679084 -0.070871 -0.0001407 0.5180394 -0.5106449 -0.0000183 -0.0000782 -0.0000393 -0.2194153 0.4637861 0.6250048 0.0001254 0.3121948 1.5703775 0.000206 0.0000997 0.0002499 0.2375052 0.9429205 -0.1423962 0.000209 -0.3532894 -0.7374368 -0.0001376 0.0002244 -0.0000912 -0.1330468 2.2268453 -0.2359977 0.0002045 -0.2210881 0.5115227 -0.0000025 -0.0001124 0.0001 0.2241476 0.4918106 0.2543275 0.0001446 0.1111491 0.4805432 0.0000623 0.0001157 0.0001144 -0.0134147 0.2340487 -0.1484681 -0.0000148 0.0116237 0.7876081 0.0000451 -0.0000007 0.0000117 0.2683412 0.6117349 -0.1699621 0.0000067 -0.4697959 0.4444542 -0.0000095 -0.0000787 0.0000254 0.280149 0.0493239 0.0702975 -0.000007 0.091012 0.0012705 0.0000159 -0.0000351 -0.0000121 0.1273128 -0.0121424 -0.1370596 -0.0000558 -0.070946 -0.0376902 -0.0000383 -0.0000469 -0.0000549 0.1265929 0.0347948 0.1140533 -0.1009805 -0.0078694 0.0013862 -0.0190837 -0.0869638 0.027579 -0.0555035 0.034691 0.1140466 0.1010545 -0.007899 0.0013928 0.0191025 0.087011 -0.0275052 -0.0554072 0.0652639 -0.027624 -0.0760214 0.1125545 -0.0238722 -0.0767776 -0.0283628 -0.0947274 -0.0636553 0.0653051 -0.0276072 0.0759614 0.1125905 -0.023918 0.0768059 0.0283261 0.0947615 -0.0636602 -0.1583045 0.0007069 0.0000342 -0.0511302 0.0820891 0.0000094 0.0000412 -0.0000027 0.1266214 unknown
polarizability: 156.0875601|-6.7759682|107.1200228|0.0194618|0.005304|47.5913415 unknown
InChI: InChI=1S/C6H7BrN2O2/c1-10-5-4(7)3-8-6(9-5)11-2/h3H,1-2H3
charge 0 multiplicity 1
18 atoms
Br -3.366133 0.903067 -0.000454
O  -1.529825 -1.65308 -0.000336
O  2.651702 0.539568 0.000579
N  0.580717 -0.589818 0.000291
N  0.750473 1.841366 0.000553
C  -0.775054 -0.508915 -0.000048
C  -1.432615 0.7526 -0.000047
C  1.277838 0.584202 0.00069
C  -0.613317 1.899352 0.00022
C  -0.806686 -2.944939 -0.000306
C  3.28702 -0.79435 0.000269
H  -1.057801 2.899437 0.000197
H  -1.60669 -3.698199 -0.00062
H  -0.175727 -3.032865 0.89995
H  -0.175234 -3.032633 -0.900239
H  2.996628 -1.363424 -0.899432
H  2.996985 -1.363641 0.899949
H  4.36452 -0.577731 0.000085
